{"text_format":"1","workbook":"xlsx","n_sheets":34,"sheets":["SchuelernamenEingabe","EingabeAngabe","Ausdruck","AusdruckHochformat","Schueler1Punkte","Schueler2Punkte","Schueler3Punkte","Schueler4Punkte","Schueler5Punkte","Schueler6Punkte","Schueler7Punkte","Schueler8Punkte","Schueler9Punkte","Schueler10Punkte","Schueler11Punkte","Schueler12Punkte","Schueler13Punkte","Schueler14Punkte","Schueler15Punkte","Schueler16Punkte","Schueler17Punkte","Schueler18Punkte","Schueler19Punkte","Schueler20Punkte","Schueler21Punkte","Schueler22Punkte","Schueler23Punkte","Schueler24Punkte","Schueler25Punkte","Schueler26Punkte","Schueler27Punkte","Schueler28Punkte","Schueler29Punkte","Schueler30Punkte"],"not_rendered":{"charts":0,"images":0,"macros":1,"external_links":0,"defined_names":0,"comments":0,"pivot_tables":0},"unopened":[],"bounds":{"document_bytes":16777216,"sheet_cells":100000,"rows_first":2000,"rows_last":500,"rows_between":2000,"halvings":0,"cell_chars":16384,"cell_head_chars":4096},"cells_cut":0,"cells_raw":0,"read":"whole","date_system":"1900"}

{"sheet":"SchuelernamenEingabe","index":0,"n_rows":35,"n_cols":5,"rows_kept":35,"cut":false,"hidden":false,"merged":[[19,3,25,3],[26,3,30,3],[31,3,33,3],[31,4,34,4],[0,0,0,1],[1,3,1,4],[2,4,10,4],[11,4,18,4],[19,4,25,4],[26,4,30,4],[2,3,10,3],[11,3,18,3]]}
["Schülernamen:"]
[1,null,null,"Notendefinitionen laut LBVO §14"]
[{"$f":"A2+1","v":2},null,null,"Sehr gut","\"Der Schüler, die Schülerin hat die nach Maßgabe des Lehrplanes gestellten Anforderungen in der Erfassung und in der Anwendung des Lehrstoffes sowie in der Durchführung der Aufgaben in weit über das Wesentliche hinausgehendem Ausmaß erfüllt und, wo dies möglich ist, deutliche Eigenständigkeit beziehungsweise die Fähigkeit zur selbständigen Anwendung seines Wissens und Könnens auf für ihn neuartige Aufgaben gezeigt\" "]
[{"$f":"A3+1","v":3}]
[{"$f":"A4+1","v":4}]
[{"$f":"A5+1","v":5}]
[{"$f":"A6+1","v":6}]
[7]
[8]
[9]
[10]
[11,null,null,"Gut","\"Der Schüler, die Schülerin hat die nach Maßgabe des Lehrplanes gestellten Anforderungen in der Erfassung und in der Anwendung des Lehrstoffes sowie in der Durchführung der Aufgaben in über das Wesentliche hinausgehendem  Ausmaß erfüllt und, wo dies möglich ist, merkliche Ansätze zur Eigenständigkeit beziehungsweise bei entsprechender Anleitung die Fähigkeit zur Anwendung seines Wissens und Könnens auf für ihn neuartige Aufgaben gezeigt\" "]
[12]
[13]
[14]
[15]
[16]
[17]
[18]
[19,null,null,"Befriedigend","\"Der Schüler, die Schülerin hat die nach Maßgabe des Lehrplanes gestellten Anforderungen in der Erfassung und in der Anwendung des Lehrstoffes sowie in der Durchführung der Aufgaben in den wesentlichen Bereichen zur Gänze erfüllt; dabei werden Mängel in der Durchführung durch merkliche Ansätze zur Eigenständigkeit ausgeglichen.\""]
[20]
[21]
[22]
[23]
[24]
[25]
[26,null,null,"Genügend","\"Der Schüler, die Schülerin hat die nach Maßgabe des Lehrplanes gestellten Anforderungen in der Erfassung und in  der Anwendung des Lehrstoffes sowie in der Durchführung der Aufgaben in den wesentlichen Bereichen überwiegend erfüllt.\""]
[27]
[28]
[29]
[30]
[null,null,null,"Nicht genügend","\"Der Schüler, die Schülerin hat die nach Maßgabe des Lehrplanes gestellten Anforderungen in der Erfassung und in der Anwendung des Lehrstoffes sowie in der Durchführung der Aufgaben in den wesentlichen Bereichen nicht überwiegend erfüllt.\""]
[]
[]
[null,{"$f":"30-(COUNTIF(B2:B31,\"\"))","v":0}]

{"sheet":"EingabeAngabe","index":1,"n_rows":60,"n_cols":37,"rows_kept":60,"cut":false,"hidden":false,"merged":[[0,1,0,2],[17,36,18,36],[19,36,20,36],[5,36,6,36],[7,36,8,36],[9,36,10,36],[11,36,12,36],[13,36,14,36],[15,36,16,36],[15,35,16,35],[13,35,14,35],[11,35,12,35],[9,35,10,35],[7,35,8,35],[5,35,6,35],[19,35,20,35],[17,35,18,35],[15,31,16,31],[13,31,14,31],[11,31,12,31],[9,31,10,31],[7,31,8,31],[5,31,6,31],[19,31,20,31],[17,31,18,31],[17,32,18,32],[19,32,20,32],[5,32,6,32],[7,32,8,32],[9,32,10,32],[11,32,12,32],[13,32,14,32],[17,34,18,34],[19,34,20,34],[5,34,6,34],[7,34,8,34],[9,34,10,34],[11,34,12,34],[13,34,14,34],[15,34,16,34],[15,32,16,32],[15,33,16,33],[13,33,14,33],[11,33,12,33],[9,33,10,33],[7,33,8,33],[5,33,6,33],[19,33,20,33],[17,33,18,33],[17,28,18,28],[19,28,20,28],[5,28,6,28],[7,28,8,28],[9,28,10,28],[11,28,12,28],[13,28,14,28],[15,28,16,28],[17,30,18,30],[19,30,20,30],[5,30,6,30],[7,30,8,30],[9,30,10,30],[11,30,12,30],[13,30,14,30],[15,30,16,30],[15,29,16,29],[13,29,14,29],[11,29,12,29],[9,29,10,29],[7,29,8,29],[5,29,6,29],[19,29,20,29],[15,24,16,24],[13,24,14,24],[11,24,12,24],[9,24,10,24],[7,24,8,24],[5,24,6,24],[19,24,20,24],[17,24,18,24],[17,25,18,25],[19,25,20,25],[5,25,6,25],[7,25,8,25],[9,25,10,25],[11,25,12,25],[13,25,14,25],[15,25,16,25],[17,29,18,29],[15,26,16,26],[13,26,14,26],[11,26,12,26],[9,26,10,26],[7,26,8,26],[5,26,6,26],[19,26,20,26],[17,26,18,26],[15,27,16,27],[13,27,14,27],[11,27,12,27],[9,27,10,27],[7,27,8,27],[5,27,6,27],[19,27,20,27],[17,27,18,27],[15,21,16,21],[13,21,14,21],[11,21,12,21],[9,21,10,21],[7,21,8,21],[5,21,6,21],[19,21,20,21],[17,21,18,21],[15,20,16,20],[13,20,14,20],[11,20,12,20],[9,20,10,20],[7,20,8,20],[5,20,6,20],[19,20,20,20],[17,20,18,20],[15,23,16,23],[13,23,14,23],[11,23,12,23],[9,23,10,23],[7,23,8,23],[5,23,6,23],[19,23,20,23],[17,23,18,23],[15,22,16,22],[13,22,14,22],[11,22,12,22],[9,22,10,22],[7,22,8,22],[5,22,6,22],[19,22,20,22],[17,22,18,22],[15,17,16,17],[13,17,14,17],[11,17,12,17],[9,17,10,17],[7,17,8,17],[5,17,6,17],[19,17,20,17],[17,17,18,17],[15,16,16,16],[13,16,14,16],[11,16,12,16],[9,16,10,16],[7,16,8,16],[5,16,6,16],[19,16,20,16],[17,16,18,16],[15,13,16,13],[13,13,14,13],[11,13,12,13],[9,13,10,13],[7,13,8,13],[5,13,6,13],[19,13,20,13],[17,13,18,13],[15,19,16,19],[13,19,14,19],[11,19,12,19],[9,19,10,19],[7,19,8,19],[5,19,6,19],[19,19,20,19],[17,19,18,19],[15,18,16,18],[13,18,14,18],[11,18,12,18],[9,18,10,18],[7,18,8,18],[5,18,6,18],[19,18,20,18],[17,18,18,18],[15,15,16,15],[13,15,14,15],[11,15,12,15],[9,15,10,15],[7,15,8,15],[5,15,6,15],[19,15,20,15],[17,15,18,15],[15,14,16,14],[13,14,14,14],[11,14,12,14],[9,14,10,14],[7,14,8,14],[5,14,6,14],[19,14,20,14],[17,14,18,14],[17,11,18,11],[19,11,20,11],[5,11,6,11],[7,11,8,11],[9,11,10,11],[11,11,12,11],[13,11,14,11],[15,11,16,11],[17,12,18,12],[19,12,20,12],[5,12,6,12],[7,12,8,12],[9,12,10,12],[11,12,12,12],[13,12,14,12],[15,12,16,12],[17,10,18,10],[19,9,20,9],[19,10,20,10],[51,2,52,2],[39,0,39,2],[37,2,37,4],[38,3,38,4],[35,3,35,4],[45,2,45,4],[26,3,26,4],[31,3,31,4],[27,3,27,4],[34,3,34,4],[32,3,32,4],[28,3,28,4],[33,3,33,4],[40,2,40,4],[41,2,41,4],[42,2,42,4],[43,2,43,4],[44,2,44,4],[5,10,6,10],[7,9,8,9],[7,10,8,10],[9,9,10,9],[9,10,10,10],[11,10,12,10],[13,10,14,10],[15,9,16,9],[15,10,16,10],[15,8,16,8],[19,8,20,8],[17,5,18,5],[19,5,20,5],[17,8,18,8],[5,9,6,9],[11,9,12,9],[17,9,18,9],[13,9,14,9],[5,8,6,8],[7,8,8,8],[9,8,10,8],[11,8,12,8],[13,8,14,8],[55,3,55,4],[54,3,54,4],[53,3,53,4],[52,3,52,4],[51,3,51,4],[50,3,50,4],[11,1,12,1],[13,1,14,1],[49,3,49,4],[48,3,48,4],[36,3,36,4],[30,3,30,4],[29,3,29,4],[15,1,16,1],[17,1,18,1],[20,2,20,4],[11,2,11,4],[12,2,12,4],[13,2,13,4],[14,2,14,4],[19,1,20,1],[17,2,17,4],[18,2,18,4],[19,2,19,4],[11,0,12,0],[13,0,14,0],[15,0,16,0],[17,0,18,0],[19,0,20,0],[3,0,3,4],[4,2,4,4],[5,2,5,4],[5,1,6,1],[7,2,7,4],[9,1,10,1],[5,0,6,0],[7,0,8,0],[9,0,10,0],[7,1,8,1],[6,2,6,4],[15,2,15,4],[16,2,16,4],[8,2,8,4],[9,2,9,4],[10,2,10,4],[1,2,1,4],[2,2,2,4],[17,7,18,7],[19,7,20,7],[17,6,18,6],[19,6,20,6],[13,5,14,5],[5,6,6,6],[7,6,8,6],[9,6,10,6],[11,6,12,6],[13,6,14,6],[5,7,6,7],[15,5,16,5],[15,6,16,6],[15,7,16,7],[5,5,6,5],[7,5,8,5],[9,5,10,5],[11,5,12,5],[7,7,8,7],[9,7,10,7],[11,7,12,7],[13,7,14,7]]}
[{"$f":"IF(D55=\"Notenschlüssel nur gültig bei mindestens 12 Punkten ÜT und mindestens 8 Punkten IT\",\"N\",\"\")","v":"N"},"Phrase",null,null,null,null,{"$f":"IF(Schueler1Punkte!$D$1=0,\"\",Schueler1Punkte!$D$1)","v":""},{"$f":"IF(Schueler2Punkte!$D$1=0,\"\",Schueler2Punkte!$D$1)","v":""},{"$f":"IF(Schueler3Punkte!$D$1=0,\"\",Schueler3Punkte!$D$1)","v":""},{"$f":"IF(Schueler4Punkte!$D$1=0,\"\",Schueler4Punkte!$D$1)","v":""},{"$f":"IF(Schueler5Punkte!$D$1=0,\"\",Schueler5Punkte!$D$1)","v":""},{"$f":"IF(Schueler6Punkte!$D$1=0,\"\",Schueler6Punkte!$D$1)","v":""},{"$f":"IF(Schueler7Punkte!$D$1=0,\"\",Schueler7Punkte!$D$1)","v":""},{"$f":"IF(Schueler8Punkte!$D$1=0,\"\",Schueler8Punkte!$D$1)","v":""},{"$f":"IF(Schueler9Punkte!$D$1=0,\"\",Schueler9Punkte!$D$1)","v":""},{"$f":"IF(Schueler10Punkte!$D$1=0,\"\",Schueler10Punkte!$D$1)","v":""},{"$f":"IF(Schueler11Punkte!$D$1=0,\"\",Schueler11Punkte!$D$1)","v":""},{"$f":"IF(Schueler12Punkte!$D$1=0,\"\",Schueler12Punkte!$D$1)","v":""},{"$f":"IF(Schueler13Punkte!$D$1=0,\"\",Schueler13Punkte!$D$1)","v":""},{"$f":"IF(Schueler14Punkte!$D$1=0,\"\",Schueler14Punkte!$D$1)","v":""},{"$f":"IF(Schueler15Punkte!$D$1=0,\"\",Schueler15Punkte!$D$1)","v":""},{"$f":"IF(Schueler16Punkte!$D$1=0,\"\",Schueler16Punkte!$D$1)","v":""},{"$f":"IF(Schueler17Punkte!$D$1=0,\"\",Schueler17Punkte!$D$1)","v":""},{"$f":"IF(Schueler18Punkte!$D$1=0,\"\",Schueler18Punkte!$D$1)","v":""},{"$f":"IF(Schueler19Punkte!$D$1=0,\"\",Schueler19Punkte!$D$1)","v":""},{"$f":"IF(Schueler20Punkte!$D$1=0,\"\",Schueler20Punkte!$D$1)","v":""},{"$f":"IF(Schueler21Punkte!$D$1=0,\"\",Schueler21Punkte!$D$1)","v":""},{"$f":"IF(Schueler22Punkte!$D$1=0,\"\",Schueler22Punkte!$D$1)","v":""},{"$f":"IF(Schueler23Punkte!$D$1=0,\"\",Schueler23Punkte!$D$1)","v":""},{"$f":"IF(Schueler24Punkte!$D$1=0,\"\",Schueler24Punkte!$D$1)","v":""},{"$f":"IF(Schueler25Punkte!$D$1=0,\"\",Schueler25Punkte!$D$1)","v":""},{"$f":"IF(Schueler26Punkte!$D$1=0,\"\",Schueler26Punkte!$D$1)","v":""},{"$f":"IF(Schueler27Punkte!$D$1=0,\"\",Schueler27Punkte!$D$1)","v":""},{"$f":"IF(Schueler28Punkte!$D$1=0,\"\",Schueler28Punkte!$D$1)","v":""},{"$f":"IF(Schueler29Punkte!$D$1=0,\"\",Schueler29Punkte!$D$1)","v":""},{"$f":"IF(Schueler30Punkte!$D$1=0,\"\",Schueler30Punkte!$D$1)","v":""},"% richtig"]
[null,null,"GESAMT",null,null,40,{"$f":"IF(G41=\"\",\"\",SUM(G39+G40))","v":""},{"$f":"IF(H41=\"\",\"\",SUM(H39+H40))","v":""},"","","","","","","","","","","","","","","","","","","","","","","","","","","",""]
[null,null,"NOTE",null,null,null,{"$f":"IF($D$55=\"Fehler\",\"\",IF(OR(G$1=\"\",G$2=\"\"),\"\",IF($A$1=\"N\",(IF(OR(G39<(($F$39/2)+$A$5),G40<(($F$40/2)+$A$5)),5,IF(G2<$G$52,4,IF(G2<$G$51,3,IF(G2<$G$50,2,IF(G2>=$G$49,1)))))),IF(G2<$G$53,5,IF(G2<$G$52,4,IF(G2<$G$51,3,IF(G2<$G$50,2,1)))))))","v":""},{"$f":"IF($D$55=\"Fehler\",\"\",IF(OR(H$1=\"\",H$2=\"\"),\"\",IF($A$1=\"N\",(IF(OR(H39<(($F$39/2)+$A$5),H40<(($F$40/2)+$A$5)),5,IF(H2<$G$52,4,IF(H2<$G$51,3,IF(H2<$G$50,2,IF(H2>=$G$49,1)))))),IF(H2<$G$53,5,IF(H2<$G$52,4,IF(H2<$G$51,3,IF(H2<$G$50,2,1)))))))","v":""},"","","","","","","","","","","","","","","","","","","","","","","","","","","",""]
["ÜBERSETZUNGSTEXT"]
[0,null,"TEXTSINN",null,null,8,{"$f":"IF(OR(G6=\"\",G6=\"f\"),\"\",SUM(G6,G8,G10,G12,G14,G16,G18,G20))","v":""},{"$f":"IF(OR(H6=\"\",H6=\"f\"),\"\",SUM(H6,H8,H10,H12,H14,H16,H18,H20))","v":""},"","","","","","","","","","","","","","","","","","","","","","","","","","","",""]
[1,"SE1",null,null,null,1,{"$f":"IF(Schueler1Punkte!$D$1=0,\"\",IF(Schueler1Punkte!$G2=\"\",\"f\",IF(Schueler1Punkte!$G2>1,\"f\",Schueler1Punkte!$G2)))","v":""},{"$f":"IF(Schueler2Punkte!$D$1=0,\"\",IF(Schueler2Punkte!$G2=\"\",\"f\",IF(Schueler2Punkte!$G2>1,\"f\",Schueler2Punkte!$G2)))","v":""},{"$f":"IF(Schueler3Punkte!$D$1=0,\"\",IF(Schueler3Punkte!$G2=\"\",\"f\",IF(Schueler3Punkte!$G2>1,\"f\",Schueler3Punkte!$G2)))","v":""},{"$f":"IF(Schueler4Punkte!$D$1=0,\"\",IF(Schueler4Punkte!$G2=\"\",\"f\",IF(Schueler4Punkte!$G2>1,\"f\",Schueler4Punkte!$G2)))","v":""},{"$f":"IF(Schueler5Punkte!$D$1=0,\"\",IF(Schueler5Punkte!$G2=\"\",\"f\",IF(Schueler5Punkte!$G2>1,\"f\",Schueler5Punkte!$G2)))","v":""},{"$f":"IF(Schueler6Punkte!$D$1=0,\"\",IF(Schueler6Punkte!$G2=\"\",\"f\",IF(Schueler6Punkte!$G2>1,\"f\",Schueler6Punkte!$G2)))","v":""},{"$f":"IF(Schueler7Punkte!$D$1=0,\"\",IF(Schueler7Punkte!$G2=\"\",\"f\",IF(Schueler7Punkte!$G2>1,\"f\",Schueler7Punkte!$G2)))","v":""},{"$f":"IF(Schueler8Punkte!$D$1=0,\"\",IF(Schueler8Punkte!$G2=\"\",\"f\",IF(Schueler8Punkte!$G2>1,\"f\",Schueler8Punkte!$G2)))","v":""},{"$f":"IF(Schueler9Punkte!$D$1=0,\"\",IF(Schueler9Punkte!$G2=\"\",\"f\",IF(Schueler9Punkte!$G2>1,\"f\",Schueler9Punkte!$G2)))","v":""},{"$f":"IF(Schueler10Punkte!$D$1=0,\"\",IF(Schueler10Punkte!$G2=\"\",\"f\",IF(Schueler10Punkte!$G2>1,\"f\",Schueler10Punkte!$G2)))","v":""},{"$f":"IF(Schueler11Punkte!$D$1=0,\"\",IF(Schueler11Punkte!$G2=\"\",\"f\",IF(Schueler11Punkte!$G2>1,\"f\",Schueler11Punkte!$G2)))","v":""},{"$f":"IF(Schueler12Punkte!$D$1=0,\"\",IF(Schueler12Punkte!$G2=\"\",\"f\",IF(Schueler12Punkte!$G2>1,\"f\",Schueler12Punkte!$G2)))","v":""},{"$f":"IF(Schueler13Punkte!$D$1=0,\"\",IF(Schueler13Punkte!$G2=\"\",\"f\",IF(Schueler13Punkte!$G2>1,\"f\",Schueler13Punkte!$G2)))","v":""},{"$f":"IF(Schueler14Punkte!$D$1=0,\"\",IF(Schueler14Punkte!$G2=\"\",\"f\",IF(Schueler14Punkte!$G2>1,\"f\",Schueler14Punkte!$G2)))","v":""},{"$f":"IF(Schueler15Punkte!$D$1=0,\"\",IF(Schueler15Punkte!$G2=\"\",\"f\",IF(Schueler15Punkte!$G2>1,\"f\",Schueler15Punkte!$G2)))","v":""},{"$f":"IF(Schueler16Punkte!$D$1=0,\"\",IF(Schueler16Punkte!$G2=\"\",\"f\",IF(Schueler16Punkte!$G2>1,\"f\",Schueler16Punkte!$G2)))","v":""},{"$f":"IF(Schueler17Punkte!$D$1=0,\"\",IF(Schueler17Punkte!$G2=\"\",\"f\",IF(Schueler17Punkte!$G2>1,\"f\",Schueler17Punkte!$G2)))","v":""},{"$f":"IF(Schueler18Punkte!$D$1=0,\"\",IF(Schueler18Punkte!$G2=\"\",\"f\",IF(Schueler18Punkte!$G2>1,\"f\",Schueler18Punkte!$G2)))","v":""},{"$f":"IF(Schueler19Punkte!$D$1=0,\"\",IF(Schueler19Punkte!$G2=\"\",\"f\",IF(Schueler19Punkte!$G2>1,\"f\",Schueler19Punkte!$G2)))","v":""},{"$f":"IF(Schueler20Punkte!$D$1=0,\"\",IF(Schueler20Punkte!$G2=\"\",\"f\",IF(Schueler20Punkte!$G2>1,\"f\",Schueler20Punkte!$G2)))","v":""},{"$f":"IF(Schueler21Punkte!$D$1=0,\"\",IF(Schueler21Punkte!$G2=\"\",\"f\",IF(Schueler21Punkte!$G2>1,\"f\",Schueler21Punkte!$G2)))","v":""},{"$f":"IF(Schueler22Punkte!$D$1=0,\"\",IF(Schueler22Punkte!$G2=\"\",\"f\",IF(Schueler22Punkte!$G2>1,\"f\",Schueler22Punkte!$G2)))","v":""},{"$f":"IF(Schueler23Punkte!$D$1=0,\"\",IF(Schueler23Punkte!$G2=\"\",\"f\",IF(Schueler23Punkte!$G2>1,\"f\",Schueler23Punkte!$G2)))","v":""},{"$f":"IF(Schueler24Punkte!$D$1=0,\"\",IF(Schueler24Punkte!$G2=\"\",\"f\",IF(Schueler24Punkte!$G2>1,\"f\",Schueler24Punkte!$G2)))","v":""},{"$f":"IF(Schueler25Punkte!$D$1=0,\"\",IF(Schueler25Punkte!$G2=\"\",\"f\",IF(Schueler25Punkte!$G2>1,\"f\",Schueler25Punkte!$G2)))","v":""},{"$f":"IF(Schueler26Punkte!$D$1=0,\"\",IF(Schueler26Punkte!$G2=\"\",\"f\",IF(Schueler26Punkte!$G2>1,\"f\",Schueler26Punkte!$G2)))","v":""},{"$f":"IF(Schueler27Punkte!$D$1=0,\"\",IF(Schueler27Punkte!$G2=\"\",\"f\",IF(Schueler27Punkte!$G2>1,\"f\",Schueler27Punkte!$G2)))","v":""},{"$f":"IF(Schueler28Punkte!$D$1=0,\"\",IF(Schueler28Punkte!$G2=\"\",\"f\",IF(Schueler28Punkte!$G2>1,\"f\",Schueler28Punkte!$G2)))","v":""},{"$f":"IF(Schueler29Punkte!$D$1=0,\"\",IF(Schueler29Punkte!$G2=\"\",\"f\",IF(Schueler29Punkte!$G2>1,\"f\",Schueler29Punkte!$G2)))","v":""},{"$f":"IF(Schueler30Punkte!$D$1=0,\"\",IF(Schueler30Punkte!$G2=\"\",\"f\",IF(Schueler30Punkte!$G2>1,\"f\",Schueler30Punkte!$G2)))","v":""},{"$f":"COUNTIF(G6:AJ6,1)/(COUNTIF(G6:AJ6,1)+COUNTIF(G6:AJ6,0))","v":{"$error":"#DIV/0!"}}]
[]
[2,"SE2",null,null,null,1,{"$f":"IF(Schueler1Punkte!$D$1=0,\"\",IF(Schueler1Punkte!$G4=\"\",\"f\",IF(Schueler1Punkte!$G4>1,\"f\",Schueler1Punkte!$G4)))","v":""},{"$f":"IF(Schueler2Punkte!$D$1=0,\"\",IF(Schueler2Punkte!$G4=\"\",\"f\",IF(Schueler2Punkte!$G4>1,\"f\",Schueler2Punkte!$G4)))","v":""},{"$f":"IF(Schueler3Punkte!$D$1=0,\"\",IF(Schueler3Punkte!$G4=\"\",\"f\",IF(Schueler3Punkte!$G4>1,\"f\",Schueler3Punkte!$G4)))","v":""},{"$f":"IF(Schueler4Punkte!$D$1=0,\"\",IF(Schueler4Punkte!$G4=\"\",\"f\",IF(Schueler4Punkte!$G4>1,\"f\",Schueler4Punkte!$G4)))","v":""},{"$f":"IF(Schueler5Punkte!$D$1=0,\"\",IF(Schueler5Punkte!$G4=\"\",\"f\",IF(Schueler5Punkte!$G4>1,\"f\",Schueler5Punkte!$G4)))","v":""},{"$f":"IF(Schueler6Punkte!$D$1=0,\"\",IF(Schueler6Punkte!$G4=\"\",\"f\",IF(Schueler6Punkte!$G4>1,\"f\",Schueler6Punkte!$G4)))","v":""},{"$f":"IF(Schueler7Punkte!$D$1=0,\"\",IF(Schueler7Punkte!$G4=\"\",\"f\",IF(Schueler7Punkte!$G4>1,\"f\",Schueler7Punkte!$G4)))","v":""},{"$f":"IF(Schueler8Punkte!$D$1=0,\"\",IF(Schueler8Punkte!$G4=\"\",\"f\",IF(Schueler8Punkte!$G4>1,\"f\",Schueler8Punkte!$G4)))","v":""},{"$f":"IF(Schueler9Punkte!$D$1=0,\"\",IF(Schueler9Punkte!$G4=\"\",\"f\",IF(Schueler9Punkte!$G4>1,\"f\",Schueler9Punkte!$G4)))","v":""},{"$f":"IF(Schueler10Punkte!$D$1=0,\"\",IF(Schueler10Punkte!$G4=\"\",\"f\",IF(Schueler10Punkte!$G4>1,\"f\",Schueler10Punkte!$G4)))","v":""},{"$f":"IF(Schueler11Punkte!$D$1=0,\"\",IF(Schueler11Punkte!$G4=\"\",\"f\",IF(Schueler11Punkte!$G4>1,\"f\",Schueler11Punkte!$G4)))","v":""},{"$f":"IF(Schueler12Punkte!$D$1=0,\"\",IF(Schueler12Punkte!$G4=\"\",\"f\",IF(Schueler12Punkte!$G4>1,\"f\",Schueler12Punkte!$G4)))","v":""},{"$f":"IF(Schueler13Punkte!$D$1=0,\"\",IF(Schueler13Punkte!$G4=\"\",\"f\",IF(Schueler13Punkte!$G4>1,\"f\",Schueler13Punkte!$G4)))","v":""},{"$f":"IF(Schueler14Punkte!$D$1=0,\"\",IF(Schueler14Punkte!$G4=\"\",\"f\",IF(Schueler14Punkte!$G4>1,\"f\",Schueler14Punkte!$G4)))","v":""},{"$f":"IF(Schueler15Punkte!$D$1=0,\"\",IF(Schueler15Punkte!$G4=\"\",\"f\",IF(Schueler15Punkte!$G4>1,\"f\",Schueler15Punkte!$G4)))","v":""},{"$f":"IF(Schueler16Punkte!$D$1=0,\"\",IF(Schueler16Punkte!$G4=\"\",\"f\",IF(Schueler16Punkte!$G4>1,\"f\",Schueler16Punkte!$G4)))","v":""},{"$f":"IF(Schueler17Punkte!$D$1=0,\"\",IF(Schueler17Punkte!$G4=\"\",\"f\",IF(Schueler17Punkte!$G4>1,\"f\",Schueler17Punkte!$G4)))","v":""},{"$f":"IF(Schueler18Punkte!$D$1=0,\"\",IF(Schueler18Punkte!$G4=\"\",\"f\",IF(Schueler18Punkte!$G4>1,\"f\",Schueler18Punkte!$G4)))","v":""},{"$f":"IF(Schueler19Punkte!$D$1=0,\"\",IF(Schueler19Punkte!$G4=\"\",\"f\",IF(Schueler19Punkte!$G4>1,\"f\",Schueler19Punkte!$G4)))","v":""},{"$f":"IF(Schueler20Punkte!$D$1=0,\"\",IF(Schueler20Punkte!$G4=\"\",\"f\",IF(Schueler20Punkte!$G4>1,\"f\",Schueler20Punkte!$G4)))","v":""},{"$f":"IF(Schueler21Punkte!$D$1=0,\"\",IF(Schueler21Punkte!$G4=\"\",\"f\",IF(Schueler21Punkte!$G4>1,\"f\",Schueler21Punkte!$G4)))","v":""},{"$f":"IF(Schueler22Punkte!$D$1=0,\"\",IF(Schueler22Punkte!$G4=\"\",\"f\",IF(Schueler22Punkte!$G4>1,\"f\",Schueler22Punkte!$G4)))","v":""},{"$f":"IF(Schueler23Punkte!$D$1=0,\"\",IF(Schueler23Punkte!$G4=\"\",\"f\",IF(Schueler23Punkte!$G4>1,\"f\",Schueler23Punkte!$G4)))","v":""},{"$f":"IF(Schueler24Punkte!$D$1=0,\"\",IF(Schueler24Punkte!$G4=\"\",\"f\",IF(Schueler24Punkte!$G4>1,\"f\",Schueler24Punkte!$G4)))","v":""},{"$f":"IF(Schueler25Punkte!$D$1=0,\"\",IF(Schueler25Punkte!$G4=\"\",\"f\",IF(Schueler25Punkte!$G4>1,\"f\",Schueler25Punkte!$G4)))","v":""},{"$f":"IF(Schueler26Punkte!$D$1=0,\"\",IF(Schueler26Punkte!$G4=\"\",\"f\",IF(Schueler26Punkte!$G4>1,\"f\",Schueler26Punkte!$G4)))","v":""},{"$f":"IF(Schueler27Punkte!$D$1=0,\"\",IF(Schueler27Punkte!$G4=\"\",\"f\",IF(Schueler27Punkte!$G4>1,\"f\",Schueler27Punkte!$G4)))","v":""},{"$f":"IF(Schueler28Punkte!$D$1=0,\"\",IF(Schueler28Punkte!$G4=\"\",\"f\",IF(Schueler28Punkte!$G4>1,\"f\",Schueler28Punkte!$G4)))","v":""},{"$f":"IF(Schueler29Punkte!$D$1=0,\"\",IF(Schueler29Punkte!$G4=\"\",\"f\",IF(Schueler29Punkte!$G4>1,\"f\",Schueler29Punkte!$G4)))","v":""},{"$f":"IF(Schueler30Punkte!$D$1=0,\"\",IF(Schueler30Punkte!$G4=\"\",\"f\",IF(Schueler30Punkte!$G4>1,\"f\",Schueler30Punkte!$G4)))","v":""},{"$f":"COUNTIF(G8:AJ8,1)/(COUNTIF(G8:AJ8,1)+COUNTIF(G8:AJ8,0))","v":{"$error":"#DIV/0!"}}]
[]
[3,"SE3",null,null,null,1,{"$f":"IF(Schueler1Punkte!$D$1=0,\"\",IF(Schueler1Punkte!$G6=\"\",\"f\",IF(Schueler1Punkte!$G6>1,\"f\",Schueler1Punkte!$G6)))","v":""},{"$f":"IF(Schueler2Punkte!$D$1=0,\"\",IF(Schueler2Punkte!$G6=\"\",\"f\",IF(Schueler2Punkte!$G6>1,\"f\",Schueler2Punkte!$G6)))","v":""},{"$f":"IF(Schueler3Punkte!$D$1=0,\"\",IF(Schueler3Punkte!$G6=\"\",\"f\",IF(Schueler3Punkte!$G6>1,\"f\",Schueler3Punkte!$G6)))","v":""},{"$f":"IF(Schueler4Punkte!$D$1=0,\"\",IF(Schueler4Punkte!$G6=\"\",\"f\",IF(Schueler4Punkte!$G6>1,\"f\",Schueler4Punkte!$G6)))","v":""},{"$f":"IF(Schueler5Punkte!$D$1=0,\"\",IF(Schueler5Punkte!$G6=\"\",\"f\",IF(Schueler5Punkte!$G6>1,\"f\",Schueler5Punkte!$G6)))","v":""},{"$f":"IF(Schueler6Punkte!$D$1=0,\"\",IF(Schueler6Punkte!$G6=\"\",\"f\",IF(Schueler6Punkte!$G6>1,\"f\",Schueler6Punkte!$G6)))","v":""},{"$f":"IF(Schueler7Punkte!$D$1=0,\"\",IF(Schueler7Punkte!$G6=\"\",\"f\",IF(Schueler7Punkte!$G6>1,\"f\",Schueler7Punkte!$G6)))","v":""},{"$f":"IF(Schueler8Punkte!$D$1=0,\"\",IF(Schueler8Punkte!$G6=\"\",\"f\",IF(Schueler8Punkte!$G6>1,\"f\",Schueler8Punkte!$G6)))","v":""},{"$f":"IF(Schueler9Punkte!$D$1=0,\"\",IF(Schueler9Punkte!$G6=\"\",\"f\",IF(Schueler9Punkte!$G6>1,\"f\",Schueler9Punkte!$G6)))","v":""},{"$f":"IF(Schueler10Punkte!$D$1=0,\"\",IF(Schueler10Punkte!$G6=\"\",\"f\",IF(Schueler10Punkte!$G6>1,\"f\",Schueler10Punkte!$G6)))","v":""},{"$f":"IF(Schueler11Punkte!$D$1=0,\"\",IF(Schueler11Punkte!$G6=\"\",\"f\",IF(Schueler11Punkte!$G6>1,\"f\",Schueler11Punkte!$G6)))","v":""},{"$f":"IF(Schueler12Punkte!$D$1=0,\"\",IF(Schueler12Punkte!$G6=\"\",\"f\",IF(Schueler12Punkte!$G6>1,\"f\",Schueler12Punkte!$G6)))","v":""},{"$f":"IF(Schueler13Punkte!$D$1=0,\"\",IF(Schueler13Punkte!$G6=\"\",\"f\",IF(Schueler13Punkte!$G6>1,\"f\",Schueler13Punkte!$G6)))","v":""},{"$f":"IF(Schueler14Punkte!$D$1=0,\"\",IF(Schueler14Punkte!$G6=\"\",\"f\",IF(Schueler14Punkte!$G6>1,\"f\",Schueler14Punkte!$G6)))","v":""},{"$f":"IF(Schueler15Punkte!$D$1=0,\"\",IF(Schueler15Punkte!$G6=\"\",\"f\",IF(Schueler15Punkte!$G6>1,\"f\",Schueler15Punkte!$G6)))","v":""},{"$f":"IF(Schueler16Punkte!$D$1=0,\"\",IF(Schueler16Punkte!$G6=\"\",\"f\",IF(Schueler16Punkte!$G6>1,\"f\",Schueler16Punkte!$G6)))","v":""},{"$f":"IF(Schueler17Punkte!$D$1=0,\"\",IF(Schueler17Punkte!$G6=\"\",\"f\",IF(Schueler17Punkte!$G6>1,\"f\",Schueler17Punkte!$G6)))","v":""},{"$f":"IF(Schueler18Punkte!$D$1=0,\"\",IF(Schueler18Punkte!$G6=\"\",\"f\",IF(Schueler18Punkte!$G6>1,\"f\",Schueler18Punkte!$G6)))","v":""},{"$f":"IF(Schueler19Punkte!$D$1=0,\"\",IF(Schueler19Punkte!$G6=\"\",\"f\",IF(Schueler19Punkte!$G6>1,\"f\",Schueler19Punkte!$G6)))","v":""},{"$f":"IF(Schueler20Punkte!$D$1=0,\"\",IF(Schueler20Punkte!$G6=\"\",\"f\",IF(Schueler20Punkte!$G6>1,\"f\",Schueler20Punkte!$G6)))","v":""},{"$f":"IF(Schueler21Punkte!$D$1=0,\"\",IF(Schueler21Punkte!$G6=\"\",\"f\",IF(Schueler21Punkte!$G6>1,\"f\",Schueler21Punkte!$G6)))","v":""},{"$f":"IF(Schueler22Punkte!$D$1=0,\"\",IF(Schueler22Punkte!$G6=\"\",\"f\",IF(Schueler22Punkte!$G6>1,\"f\",Schueler22Punkte!$G6)))","v":""},{"$f":"IF(Schueler23Punkte!$D$1=0,\"\",IF(Schueler23Punkte!$G6=\"\",\"f\",IF(Schueler23Punkte!$G6>1,\"f\",Schueler23Punkte!$G6)))","v":""},{"$f":"IF(Schueler24Punkte!$D$1=0,\"\",IF(Schueler24Punkte!$G6=\"\",\"f\",IF(Schueler24Punkte!$G6>1,\"f\",Schueler24Punkte!$G6)))","v":""},{"$f":"IF(Schueler25Punkte!$D$1=0,\"\",IF(Schueler25Punkte!$G6=\"\",\"f\",IF(Schueler25Punkte!$G6>1,\"f\",Schueler25Punkte!$G6)))","v":""},{"$f":"IF(Schueler26Punkte!$D$1=0,\"\",IF(Schueler26Punkte!$G6=\"\",\"f\",IF(Schueler26Punkte!$G6>1,\"f\",Schueler26Punkte!$G6)))","v":""},{"$f":"IF(Schueler27Punkte!$D$1=0,\"\",IF(Schueler27Punkte!$G6=\"\",\"f\",IF(Schueler27Punkte!$G6>1,\"f\",Schueler27Punkte!$G6)))","v":""},{"$f":"IF(Schueler28Punkte!$D$1=0,\"\",IF(Schueler28Punkte!$G6=\"\",\"f\",IF(Schueler28Punkte!$G6>1,\"f\",Schueler28Punkte!$G6)))","v":""},{"$f":"IF(Schueler29Punkte!$D$1=0,\"\",IF(Schueler29Punkte!$G6=\"\",\"f\",IF(Schueler29Punkte!$G6>1,\"f\",Schueler29Punkte!$G6)))","v":""},{"$f":"IF(Schueler30Punkte!$D$1=0,\"\",IF(Schueler30Punkte!$G6=\"\",\"f\",IF(Schueler30Punkte!$G6>1,\"f\",Schueler30Punkte!$G6)))","v":""},{"$f":"COUNTIF(G10:AJ10,1)/(COUNTIF(G10:AJ10,1)+COUNTIF(G10:AJ10,0))","v":{"$error":"#DIV/0!"}}]
[]
[4,"SE4",null,null,null,1,{"$f":"IF(Schueler1Punkte!$D$1=0,\"\",IF(Schueler1Punkte!$G8=\"\",\"f\",IF(Schueler1Punkte!$G8>1,\"f\",Schueler1Punkte!$G8)))","v":""},{"$f":"IF(Schueler2Punkte!$D$1=0,\"\",IF(Schueler2Punkte!$G8=\"\",\"f\",IF(Schueler2Punkte!$G8>1,\"f\",Schueler2Punkte!$G8)))","v":""},{"$f":"IF(Schueler3Punkte!$D$1=0,\"\",IF(Schueler3Punkte!$G8=\"\",\"f\",IF(Schueler3Punkte!$G8>1,\"f\",Schueler3Punkte!$G8)))","v":""},{"$f":"IF(Schueler4Punkte!$D$1=0,\"\",IF(Schueler4Punkte!$G8=\"\",\"f\",IF(Schueler4Punkte!$G8>1,\"f\",Schueler4Punkte!$G8)))","v":""},{"$f":"IF(Schueler5Punkte!$D$1=0,\"\",IF(Schueler5Punkte!$G8=\"\",\"f\",IF(Schueler5Punkte!$G8>1,\"f\",Schueler5Punkte!$G8)))","v":""},{"$f":"IF(Schueler6Punkte!$D$1=0,\"\",IF(Schueler6Punkte!$G8=\"\",\"f\",IF(Schueler6Punkte!$G8>1,\"f\",Schueler6Punkte!$G8)))","v":""},{"$f":"IF(Schueler7Punkte!$D$1=0,\"\",IF(Schueler7Punkte!$G8=\"\",\"f\",IF(Schueler7Punkte!$G8>1,\"f\",Schueler7Punkte!$G8)))","v":""},{"$f":"IF(Schueler8Punkte!$D$1=0,\"\",IF(Schueler8Punkte!$G8=\"\",\"f\",IF(Schueler8Punkte!$G8>1,\"f\",Schueler8Punkte!$G8)))","v":""},{"$f":"IF(Schueler9Punkte!$D$1=0,\"\",IF(Schueler9Punkte!$G8=\"\",\"f\",IF(Schueler9Punkte!$G8>1,\"f\",Schueler9Punkte!$G8)))","v":""},{"$f":"IF(Schueler10Punkte!$D$1=0,\"\",IF(Schueler10Punkte!$G8=\"\",\"f\",IF(Schueler10Punkte!$G8>1,\"f\",Schueler10Punkte!$G8)))","v":""},{"$f":"IF(Schueler11Punkte!$D$1=0,\"\",IF(Schueler11Punkte!$G8=\"\",\"f\",IF(Schueler11Punkte!$G8>1,\"f\",Schueler11Punkte!$G8)))","v":""},{"$f":"IF(Schueler12Punkte!$D$1=0,\"\",IF(Schueler12Punkte!$G8=\"\",\"f\",IF(Schueler12Punkte!$G8>1,\"f\",Schueler12Punkte!$G8)))","v":""},{"$f":"IF(Schueler13Punkte!$D$1=0,\"\",IF(Schueler13Punkte!$G8=\"\",\"f\",IF(Schueler13Punkte!$G8>1,\"f\",Schueler13Punkte!$G8)))","v":""},{"$f":"IF(Schueler14Punkte!$D$1=0,\"\",IF(Schueler14Punkte!$G8=\"\",\"f\",IF(Schueler14Punkte!$G8>1,\"f\",Schueler14Punkte!$G8)))","v":""},{"$f":"IF(Schueler15Punkte!$D$1=0,\"\",IF(Schueler15Punkte!$G8=\"\",\"f\",IF(Schueler15Punkte!$G8>1,\"f\",Schueler15Punkte!$G8)))","v":""},{"$f":"IF(Schueler16Punkte!$D$1=0,\"\",IF(Schueler16Punkte!$G8=\"\",\"f\",IF(Schueler16Punkte!$G8>1,\"f\",Schueler16Punkte!$G8)))","v":""},{"$f":"IF(Schueler17Punkte!$D$1=0,\"\",IF(Schueler17Punkte!$G8=\"\",\"f\",IF(Schueler17Punkte!$G8>1,\"f\",Schueler17Punkte!$G8)))","v":""},{"$f":"IF(Schueler18Punkte!$D$1=0,\"\",IF(Schueler18Punkte!$G8=\"\",\"f\",IF(Schueler18Punkte!$G8>1,\"f\",Schueler18Punkte!$G8)))","v":""},{"$f":"IF(Schueler19Punkte!$D$1=0,\"\",IF(Schueler19Punkte!$G8=\"\",\"f\",IF(Schueler19Punkte!$G8>1,\"f\",Schueler19Punkte!$G8)))","v":""},{"$f":"IF(Schueler20Punkte!$D$1=0,\"\",IF(Schueler20Punkte!$G8=\"\",\"f\",IF(Schueler20Punkte!$G8>1,\"f\",Schueler20Punkte!$G8)))","v":""},{"$f":"IF(Schueler21Punkte!$D$1=0,\"\",IF(Schueler21Punkte!$G8=\"\",\"f\",IF(Schueler21Punkte!$G8>1,\"f\",Schueler21Punkte!$G8)))","v":""},{"$f":"IF(Schueler22Punkte!$D$1=0,\"\",IF(Schueler22Punkte!$G8=\"\",\"f\",IF(Schueler22Punkte!$G8>1,\"f\",Schueler22Punkte!$G8)))","v":""},{"$f":"IF(Schueler23Punkte!$D$1=0,\"\",IF(Schueler23Punkte!$G8=\"\",\"f\",IF(Schueler23Punkte!$G8>1,\"f\",Schueler23Punkte!$G8)))","v":""},{"$f":"IF(Schueler24Punkte!$D$1=0,\"\",IF(Schueler24Punkte!$G8=\"\",\"f\",IF(Schueler24Punkte!$G8>1,\"f\",Schueler24Punkte!$G8)))","v":""},{"$f":"IF(Schueler25Punkte!$D$1=0,\"\",IF(Schueler25Punkte!$G8=\"\",\"f\",IF(Schueler25Punkte!$G8>1,\"f\",Schueler25Punkte!$G8)))","v":""},{"$f":"IF(Schueler26Punkte!$D$1=0,\"\",IF(Schueler26Punkte!$G8=\"\",\"f\",IF(Schueler26Punkte!$G8>1,\"f\",Schueler26Punkte!$G8)))","v":""},{"$f":"IF(Schueler27Punkte!$D$1=0,\"\",IF(Schueler27Punkte!$G8=\"\",\"f\",IF(Schueler27Punkte!$G8>1,\"f\",Schueler27Punkte!$G8)))","v":""},{"$f":"IF(Schueler28Punkte!$D$1=0,\"\",IF(Schueler28Punkte!$G8=\"\",\"f\",IF(Schueler28Punkte!$G8>1,\"f\",Schueler28Punkte!$G8)))","v":""},{"$f":"IF(Schueler29Punkte!$D$1=0,\"\",IF(Schueler29Punkte!$G8=\"\",\"f\",IF(Schueler29Punkte!$G8>1,\"f\",Schueler29Punkte!$G8)))","v":""},{"$f":"IF(Schueler30Punkte!$D$1=0,\"\",IF(Schueler30Punkte!$G8=\"\",\"f\",IF(Schueler30Punkte!$G8>1,\"f\",Schueler30Punkte!$G8)))","v":""},{"$f":"COUNTIF(G12:AJ12,1)/(COUNTIF(G12:AJ12,1)+COUNTIF(G12:AJ12,0))","v":{"$error":"#DIV/0!"}}]
[]
[5,"SE5",null,null,null,1,{"$f":"IF(Schueler1Punkte!$D$1=0,\"\",IF(Schueler1Punkte!$G10=\"\",\"f\",IF(Schueler1Punkte!$G10>1,\"f\",Schueler1Punkte!$G10)))","v":""},{"$f":"IF(Schueler2Punkte!$D$1=0,\"\",IF(Schueler2Punkte!$G10=\"\",\"f\",IF(Schueler2Punkte!$G10>1,\"f\",Schueler2Punkte!$G10)))","v":""},{"$f":"IF(Schueler3Punkte!$D$1=0,\"\",IF(Schueler3Punkte!$G10=\"\",\"f\",IF(Schueler3Punkte!$G10>1,\"f\",Schueler3Punkte!$G10)))","v":""},{"$f":"IF(Schueler4Punkte!$D$1=0,\"\",IF(Schueler4Punkte!$G10=\"\",\"f\",IF(Schueler4Punkte!$G10>1,\"f\",Schueler4Punkte!$G10)))","v":""},{"$f":"IF(Schueler5Punkte!$D$1=0,\"\",IF(Schueler5Punkte!$G10=\"\",\"f\",IF(Schueler5Punkte!$G10>1,\"f\",Schueler5Punkte!$G10)))","v":""},{"$f":"IF(Schueler6Punkte!$D$1=0,\"\",IF(Schueler6Punkte!$G10=\"\",\"f\",IF(Schueler6Punkte!$G10>1,\"f\",Schueler6Punkte!$G10)))","v":""},{"$f":"IF(Schueler7Punkte!$D$1=0,\"\",IF(Schueler7Punkte!$G10=\"\",\"f\",IF(Schueler7Punkte!$G10>1,\"f\",Schueler7Punkte!$G10)))","v":""},{"$f":"IF(Schueler8Punkte!$D$1=0,\"\",IF(Schueler8Punkte!$G10=\"\",\"f\",IF(Schueler8Punkte!$G10>1,\"f\",Schueler8Punkte!$G10)))","v":""},{"$f":"IF(Schueler9Punkte!$D$1=0,\"\",IF(Schueler9Punkte!$G10=\"\",\"f\",IF(Schueler9Punkte!$G10>1,\"f\",Schueler9Punkte!$G10)))","v":""},{"$f":"IF(Schueler10Punkte!$D$1=0,\"\",IF(Schueler10Punkte!$G10=\"\",\"f\",IF(Schueler10Punkte!$G10>1,\"f\",Schueler10Punkte!$G10)))","v":""},{"$f":"IF(Schueler11Punkte!$D$1=0,\"\",IF(Schueler11Punkte!$G10=\"\",\"f\",IF(Schueler11Punkte!$G10>1,\"f\",Schueler11Punkte!$G10)))","v":""},{"$f":"IF(Schueler12Punkte!$D$1=0,\"\",IF(Schueler12Punkte!$G10=\"\",\"f\",IF(Schueler12Punkte!$G10>1,\"f\",Schueler12Punkte!$G10)))","v":""},{"$f":"IF(Schueler13Punkte!$D$1=0,\"\",IF(Schueler13Punkte!$G10=\"\",\"f\",IF(Schueler13Punkte!$G10>1,\"f\",Schueler13Punkte!$G10)))","v":""},{"$f":"IF(Schueler14Punkte!$D$1=0,\"\",IF(Schueler14Punkte!$G10=\"\",\"f\",IF(Schueler14Punkte!$G10>1,\"f\",Schueler14Punkte!$G10)))","v":""},{"$f":"IF(Schueler15Punkte!$D$1=0,\"\",IF(Schueler15Punkte!$G10=\"\",\"f\",IF(Schueler15Punkte!$G10>1,\"f\",Schueler15Punkte!$G10)))","v":""},{"$f":"IF(Schueler16Punkte!$D$1=0,\"\",IF(Schueler16Punkte!$G10=\"\",\"f\",IF(Schueler16Punkte!$G10>1,\"f\",Schueler16Punkte!$G10)))","v":""},{"$f":"IF(Schueler17Punkte!$D$1=0,\"\",IF(Schueler17Punkte!$G10=\"\",\"f\",IF(Schueler17Punkte!$G10>1,\"f\",Schueler17Punkte!$G10)))","v":""},{"$f":"IF(Schueler18Punkte!$D$1=0,\"\",IF(Schueler18Punkte!$G10=\"\",\"f\",IF(Schueler18Punkte!$G10>1,\"f\",Schueler18Punkte!$G10)))","v":""},{"$f":"IF(Schueler19Punkte!$D$1=0,\"\",IF(Schueler19Punkte!$G10=\"\",\"f\",IF(Schueler19Punkte!$G10>1,\"f\",Schueler19Punkte!$G10)))","v":""},{"$f":"IF(Schueler20Punkte!$D$1=0,\"\",IF(Schueler20Punkte!$G10=\"\",\"f\",IF(Schueler20Punkte!$G10>1,\"f\",Schueler20Punkte!$G10)))","v":""},{"$f":"IF(Schueler21Punkte!$D$1=0,\"\",IF(Schueler21Punkte!$G10=\"\",\"f\",IF(Schueler21Punkte!$G10>1,\"f\",Schueler21Punkte!$G10)))","v":""},{"$f":"IF(Schueler22Punkte!$D$1=0,\"\",IF(Schueler22Punkte!$G10=\"\",\"f\",IF(Schueler22Punkte!$G10>1,\"f\",Schueler22Punkte!$G10)))","v":""},{"$f":"IF(Schueler23Punkte!$D$1=0,\"\",IF(Schueler23Punkte!$G10=\"\",\"f\",IF(Schueler23Punkte!$G10>1,\"f\",Schueler23Punkte!$G10)))","v":""},{"$f":"IF(Schueler24Punkte!$D$1=0,\"\",IF(Schueler24Punkte!$G10=\"\",\"f\",IF(Schueler24Punkte!$G10>1,\"f\",Schueler24Punkte!$G10)))","v":""},{"$f":"IF(Schueler25Punkte!$D$1=0,\"\",IF(Schueler25Punkte!$G10=\"\",\"f\",IF(Schueler25Punkte!$G10>1,\"f\",Schueler25Punkte!$G10)))","v":""},{"$f":"IF(Schueler26Punkte!$D$1=0,\"\",IF(Schueler26Punkte!$G10=\"\",\"f\",IF(Schueler26Punkte!$G10>1,\"f\",Schueler26Punkte!$G10)))","v":""},{"$f":"IF(Schueler27Punkte!$D$1=0,\"\",IF(Schueler27Punkte!$G10=\"\",\"f\",IF(Schueler27Punkte!$G10>1,\"f\",Schueler27Punkte!$G10)))","v":""},{"$f":"IF(Schueler28Punkte!$D$1=0,\"\",IF(Schueler28Punkte!$G10=\"\",\"f\",IF(Schueler28Punkte!$G10>1,\"f\",Schueler28Punkte!$G10)))","v":""},{"$f":"IF(Schueler29Punkte!$D$1=0,\"\",IF(Schueler29Punkte!$G10=\"\",\"f\",IF(Schueler29Punkte!$G10>1,\"f\",Schueler29Punkte!$G10)))","v":""},{"$f":"IF(Schueler30Punkte!$D$1=0,\"\",IF(Schueler30Punkte!$G10=\"\",\"f\",IF(Schueler30Punkte!$G10>1,\"f\",Schueler30Punkte!$G10)))","v":""},{"$f":"COUNTIF(G14:AJ14,1)/(COUNTIF(G14:AJ14,1)+COUNTIF(G14:AJ14,0))","v":{"$error":"#DIV/0!"}}]
[]
[6,"SE6",null,null,null,1,{"$f":"IF(Schueler1Punkte!$D$1=0,\"\",IF(Schueler1Punkte!$G12=\"\",\"f\",IF(Schueler1Punkte!$G12>1,\"f\",Schueler1Punkte!$G12)))","v":""},{"$f":"IF(Schueler2Punkte!$D$1=0,\"\",IF(Schueler2Punkte!$G12=\"\",\"f\",IF(Schueler2Punkte!$G12>1,\"f\",Schueler2Punkte!$G12)))","v":""},{"$f":"IF(Schueler3Punkte!$D$1=0,\"\",IF(Schueler3Punkte!$G12=\"\",\"f\",IF(Schueler3Punkte!$G12>1,\"f\",Schueler3Punkte!$G12)))","v":""},{"$f":"IF(Schueler4Punkte!$D$1=0,\"\",IF(Schueler4Punkte!$G12=\"\",\"f\",IF(Schueler4Punkte!$G12>1,\"f\",Schueler4Punkte!$G12)))","v":""},{"$f":"IF(Schueler5Punkte!$D$1=0,\"\",IF(Schueler5Punkte!$G12=\"\",\"f\",IF(Schueler5Punkte!$G12>1,\"f\",Schueler5Punkte!$G12)))","v":""},{"$f":"IF(Schueler6Punkte!$D$1=0,\"\",IF(Schueler6Punkte!$G12=\"\",\"f\",IF(Schueler6Punkte!$G12>1,\"f\",Schueler6Punkte!$G12)))","v":""},{"$f":"IF(Schueler7Punkte!$D$1=0,\"\",IF(Schueler7Punkte!$G12=\"\",\"f\",IF(Schueler7Punkte!$G12>1,\"f\",Schueler7Punkte!$G12)))","v":""},{"$f":"IF(Schueler8Punkte!$D$1=0,\"\",IF(Schueler8Punkte!$G12=\"\",\"f\",IF(Schueler8Punkte!$G12>1,\"f\",Schueler8Punkte!$G12)))","v":""},{"$f":"IF(Schueler9Punkte!$D$1=0,\"\",IF(Schueler9Punkte!$G12=\"\",\"f\",IF(Schueler9Punkte!$G12>1,\"f\",Schueler9Punkte!$G12)))","v":""},{"$f":"IF(Schueler10Punkte!$D$1=0,\"\",IF(Schueler10Punkte!$G12=\"\",\"f\",IF(Schueler10Punkte!$G12>1,\"f\",Schueler10Punkte!$G12)))","v":""},{"$f":"IF(Schueler11Punkte!$D$1=0,\"\",IF(Schueler11Punkte!$G12=\"\",\"f\",IF(Schueler11Punkte!$G12>1,\"f\",Schueler11Punkte!$G12)))","v":""},{"$f":"IF(Schueler12Punkte!$D$1=0,\"\",IF(Schueler12Punkte!$G12=\"\",\"f\",IF(Schueler12Punkte!$G12>1,\"f\",Schueler12Punkte!$G12)))","v":""},{"$f":"IF(Schueler13Punkte!$D$1=0,\"\",IF(Schueler13Punkte!$G12=\"\",\"f\",IF(Schueler13Punkte!$G12>1,\"f\",Schueler13Punkte!$G12)))","v":""},{"$f":"IF(Schueler14Punkte!$D$1=0,\"\",IF(Schueler14Punkte!$G12=\"\",\"f\",IF(Schueler14Punkte!$G12>1,\"f\",Schueler14Punkte!$G12)))","v":""},{"$f":"IF(Schueler15Punkte!$D$1=0,\"\",IF(Schueler15Punkte!$G12=\"\",\"f\",IF(Schueler15Punkte!$G12>1,\"f\",Schueler15Punkte!$G12)))","v":""},{"$f":"IF(Schueler16Punkte!$D$1=0,\"\",IF(Schueler16Punkte!$G12=\"\",\"f\",IF(Schueler16Punkte!$G12>1,\"f\",Schueler16Punkte!$G12)))","v":""},{"$f":"IF(Schueler17Punkte!$D$1=0,\"\",IF(Schueler17Punkte!$G12=\"\",\"f\",IF(Schueler17Punkte!$G12>1,\"f\",Schueler17Punkte!$G12)))","v":""},{"$f":"IF(Schueler18Punkte!$D$1=0,\"\",IF(Schueler18Punkte!$G12=\"\",\"f\",IF(Schueler18Punkte!$G12>1,\"f\",Schueler18Punkte!$G12)))","v":""},{"$f":"IF(Schueler19Punkte!$D$1=0,\"\",IF(Schueler19Punkte!$G12=\"\",\"f\",IF(Schueler19Punkte!$G12>1,\"f\",Schueler19Punkte!$G12)))","v":""},{"$f":"IF(Schueler20Punkte!$D$1=0,\"\",IF(Schueler20Punkte!$G12=\"\",\"f\",IF(Schueler20Punkte!$G12>1,\"f\",Schueler20Punkte!$G12)))","v":""},{"$f":"IF(Schueler21Punkte!$D$1=0,\"\",IF(Schueler21Punkte!$G12=\"\",\"f\",IF(Schueler21Punkte!$G12>1,\"f\",Schueler21Punkte!$G12)))","v":""},{"$f":"IF(Schueler22Punkte!$D$1=0,\"\",IF(Schueler22Punkte!$G12=\"\",\"f\",IF(Schueler22Punkte!$G12>1,\"f\",Schueler22Punkte!$G12)))","v":""},{"$f":"IF(Schueler23Punkte!$D$1=0,\"\",IF(Schueler23Punkte!$G12=\"\",\"f\",IF(Schueler23Punkte!$G12>1,\"f\",Schueler23Punkte!$G12)))","v":""},{"$f":"IF(Schueler24Punkte!$D$1=0,\"\",IF(Schueler24Punkte!$G12=\"\",\"f\",IF(Schueler24Punkte!$G12>1,\"f\",Schueler24Punkte!$G12)))","v":""},{"$f":"IF(Schueler25Punkte!$D$1=0,\"\",IF(Schueler25Punkte!$G12=\"\",\"f\",IF(Schueler25Punkte!$G12>1,\"f\",Schueler25Punkte!$G12)))","v":""},{"$f":"IF(Schueler26Punkte!$D$1=0,\"\",IF(Schueler26Punkte!$G12=\"\",\"f\",IF(Schueler26Punkte!$G12>1,\"f\",Schueler26Punkte!$G12)))","v":""},{"$f":"IF(Schueler27Punkte!$D$1=0,\"\",IF(Schueler27Punkte!$G12=\"\",\"f\",IF(Schueler27Punkte!$G12>1,\"f\",Schueler27Punkte!$G12)))","v":""},{"$f":"IF(Schueler28Punkte!$D$1=0,\"\",IF(Schueler28Punkte!$G12=\"\",\"f\",IF(Schueler28Punkte!$G12>1,\"f\",Schueler28Punkte!$G12)))","v":""},{"$f":"IF(Schueler29Punkte!$D$1=0,\"\",IF(Schueler29Punkte!$G12=\"\",\"f\",IF(Schueler29Punkte!$G12>1,\"f\",Schueler29Punkte!$G12)))","v":""},{"$f":"IF(Schueler30Punkte!$D$1=0,\"\",IF(Schueler30Punkte!$G12=\"\",\"f\",IF(Schueler30Punkte!$G12>1,\"f\",Schueler30Punkte!$G12)))","v":""},{"$f":"COUNTIF(G16:AJ16,1)/(COUNTIF(G16:AJ16,1)+COUNTIF(G16:AJ16,0))","v":{"$error":"#DIV/0!"}}]
[]
[7,"SE7",null,null,null,1,{"$f":"IF(Schueler1Punkte!$D$1=0,\"\",IF(Schueler1Punkte!$G14=\"\",\"f\",IF(Schueler1Punkte!$G14>1,\"f\",Schueler1Punkte!$G14)))","v":""},{"$f":"IF(Schueler2Punkte!$D$1=0,\"\",IF(Schueler2Punkte!$G14=\"\",\"f\",IF(Schueler2Punkte!$G14>1,\"f\",Schueler2Punkte!$G14)))","v":""},{"$f":"IF(Schueler3Punkte!$D$1=0,\"\",IF(Schueler3Punkte!$G14=\"\",\"f\",IF(Schueler3Punkte!$G14>1,\"f\",Schueler3Punkte!$G14)))","v":""},{"$f":"IF(Schueler4Punkte!$D$1=0,\"\",IF(Schueler4Punkte!$G14=\"\",\"f\",IF(Schueler4Punkte!$G14>1,\"f\",Schueler4Punkte!$G14)))","v":""},{"$f":"IF(Schueler5Punkte!$D$1=0,\"\",IF(Schueler5Punkte!$G14=\"\",\"f\",IF(Schueler5Punkte!$G14>1,\"f\",Schueler5Punkte!$G14)))","v":""},{"$f":"IF(Schueler6Punkte!$D$1=0,\"\",IF(Schueler6Punkte!$G14=\"\",\"f\",IF(Schueler6Punkte!$G14>1,\"f\",Schueler6Punkte!$G14)))","v":""},{"$f":"IF(Schueler7Punkte!$D$1=0,\"\",IF(Schueler7Punkte!$G14=\"\",\"f\",IF(Schueler7Punkte!$G14>1,\"f\",Schueler7Punkte!$G14)))","v":""},{"$f":"IF(Schueler8Punkte!$D$1=0,\"\",IF(Schueler8Punkte!$G14=\"\",\"f\",IF(Schueler8Punkte!$G14>1,\"f\",Schueler8Punkte!$G14)))","v":""},{"$f":"IF(Schueler9Punkte!$D$1=0,\"\",IF(Schueler9Punkte!$G14=\"\",\"f\",IF(Schueler9Punkte!$G14>1,\"f\",Schueler9Punkte!$G14)))","v":""},{"$f":"IF(Schueler10Punkte!$D$1=0,\"\",IF(Schueler10Punkte!$G14=\"\",\"f\",IF(Schueler10Punkte!$G14>1,\"f\",Schueler10Punkte!$G14)))","v":""},{"$f":"IF(Schueler11Punkte!$D$1=0,\"\",IF(Schueler11Punkte!$G14=\"\",\"f\",IF(Schueler11Punkte!$G14>1,\"f\",Schueler11Punkte!$G14)))","v":""},{"$f":"IF(Schueler12Punkte!$D$1=0,\"\",IF(Schueler12Punkte!$G14=\"\",\"f\",IF(Schueler12Punkte!$G14>1,\"f\",Schueler12Punkte!$G14)))","v":""},{"$f":"IF(Schueler13Punkte!$D$1=0,\"\",IF(Schueler13Punkte!$G14=\"\",\"f\",IF(Schueler13Punkte!$G14>1,\"f\",Schueler13Punkte!$G14)))","v":""},{"$f":"IF(Schueler14Punkte!$D$1=0,\"\",IF(Schueler14Punkte!$G14=\"\",\"f\",IF(Schueler14Punkte!$G14>1,\"f\",Schueler14Punkte!$G14)))","v":""},{"$f":"IF(Schueler15Punkte!$D$1=0,\"\",IF(Schueler15Punkte!$G14=\"\",\"f\",IF(Schueler15Punkte!$G14>1,\"f\",Schueler15Punkte!$G14)))","v":""},{"$f":"IF(Schueler16Punkte!$D$1=0,\"\",IF(Schueler16Punkte!$G14=\"\",\"f\",IF(Schueler16Punkte!$G14>1,\"f\",Schueler16Punkte!$G14)))","v":""},{"$f":"IF(Schueler17Punkte!$D$1=0,\"\",IF(Schueler17Punkte!$G14=\"\",\"f\",IF(Schueler17Punkte!$G14>1,\"f\",Schueler17Punkte!$G14)))","v":""},{"$f":"IF(Schueler18Punkte!$D$1=0,\"\",IF(Schueler18Punkte!$G14=\"\",\"f\",IF(Schueler18Punkte!$G14>1,\"f\",Schueler18Punkte!$G14)))","v":""},{"$f":"IF(Schueler19Punkte!$D$1=0,\"\",IF(Schueler19Punkte!$G14=\"\",\"f\",IF(Schueler19Punkte!$G14>1,\"f\",Schueler19Punkte!$G14)))","v":""},{"$f":"IF(Schueler20Punkte!$D$1=0,\"\",IF(Schueler20Punkte!$G14=\"\",\"f\",IF(Schueler20Punkte!$G14>1,\"f\",Schueler20Punkte!$G14)))","v":""},{"$f":"IF(Schueler21Punkte!$D$1=0,\"\",IF(Schueler21Punkte!$G14=\"\",\"f\",IF(Schueler21Punkte!$G14>1,\"f\",Schueler21Punkte!$G14)))","v":""},{"$f":"IF(Schueler22Punkte!$D$1=0,\"\",IF(Schueler22Punkte!$G14=\"\",\"f\",IF(Schueler22Punkte!$G14>1,\"f\",Schueler22Punkte!$G14)))","v":""},{"$f":"IF(Schueler23Punkte!$D$1=0,\"\",IF(Schueler23Punkte!$G14=\"\",\"f\",IF(Schueler23Punkte!$G14>1,\"f\",Schueler23Punkte!$G14)))","v":""},{"$f":"IF(Schueler24Punkte!$D$1=0,\"\",IF(Schueler24Punkte!$G14=\"\",\"f\",IF(Schueler24Punkte!$G14>1,\"f\",Schueler24Punkte!$G14)))","v":""},{"$f":"IF(Schueler25Punkte!$D$1=0,\"\",IF(Schueler25Punkte!$G14=\"\",\"f\",IF(Schueler25Punkte!$G14>1,\"f\",Schueler25Punkte!$G14)))","v":""},{"$f":"IF(Schueler26Punkte!$D$1=0,\"\",IF(Schueler26Punkte!$G14=\"\",\"f\",IF(Schueler26Punkte!$G14>1,\"f\",Schueler26Punkte!$G14)))","v":""},{"$f":"IF(Schueler27Punkte!$D$1=0,\"\",IF(Schueler27Punkte!$G14=\"\",\"f\",IF(Schueler27Punkte!$G14>1,\"f\",Schueler27Punkte!$G14)))","v":""},{"$f":"IF(Schueler28Punkte!$D$1=0,\"\",IF(Schueler28Punkte!$G14=\"\",\"f\",IF(Schueler28Punkte!$G14>1,\"f\",Schueler28Punkte!$G14)))","v":""},{"$f":"IF(Schueler29Punkte!$D$1=0,\"\",IF(Schueler29Punkte!$G14=\"\",\"f\",IF(Schueler29Punkte!$G14>1,\"f\",Schueler29Punkte!$G14)))","v":""},{"$f":"IF(Schueler30Punkte!$D$1=0,\"\",IF(Schueler30Punkte!$G14=\"\",\"f\",IF(Schueler30Punkte!$G14>1,\"f\",Schueler30Punkte!$G14)))","v":""},{"$f":"COUNTIF(G18:AJ18,1)/(COUNTIF(G18:AJ18,1)+COUNTIF(G18:AJ18,0))","v":{"$error":"#DIV/0!"}}]
[]
[8,"SE8",null,null,null,1,{"$f":"IF(Schueler1Punkte!$D$1=0,\"\",IF(Schueler1Punkte!$G16=\"\",\"f\",IF(Schueler1Punkte!$G16>1,\"f\",Schueler1Punkte!$G16)))","v":""},{"$f":"IF(Schueler2Punkte!$D$1=0,\"\",IF(Schueler2Punkte!$G16=\"\",\"f\",IF(Schueler2Punkte!$G16>1,\"f\",Schueler2Punkte!$G16)))","v":""},{"$f":"IF(Schueler3Punkte!$D$1=0,\"\",IF(Schueler3Punkte!$G16=\"\",\"f\",IF(Schueler3Punkte!$G16>1,\"f\",Schueler3Punkte!$G16)))","v":""},{"$f":"IF(Schueler4Punkte!$D$1=0,\"\",IF(Schueler4Punkte!$G16=\"\",\"f\",IF(Schueler4Punkte!$G16>1,\"f\",Schueler4Punkte!$G16)))","v":""},{"$f":"IF(Schueler5Punkte!$D$1=0,\"\",IF(Schueler5Punkte!$G16=\"\",\"f\",IF(Schueler5Punkte!$G16>1,\"f\",Schueler5Punkte!$G16)))","v":""},{"$f":"IF(Schueler6Punkte!$D$1=0,\"\",IF(Schueler6Punkte!$G16=\"\",\"f\",IF(Schueler6Punkte!$G16>1,\"f\",Schueler6Punkte!$G16)))","v":""},{"$f":"IF(Schueler7Punkte!$D$1=0,\"\",IF(Schueler7Punkte!$G16=\"\",\"f\",IF(Schueler7Punkte!$G16>1,\"f\",Schueler7Punkte!$G16)))","v":""},{"$f":"IF(Schueler8Punkte!$D$1=0,\"\",IF(Schueler8Punkte!$G16=\"\",\"f\",IF(Schueler8Punkte!$G16>1,\"f\",Schueler8Punkte!$G16)))","v":""},{"$f":"IF(Schueler9Punkte!$D$1=0,\"\",IF(Schueler9Punkte!$G16=\"\",\"f\",IF(Schueler9Punkte!$G16>1,\"f\",Schueler9Punkte!$G16)))","v":""},{"$f":"IF(Schueler10Punkte!$D$1=0,\"\",IF(Schueler10Punkte!$G16=\"\",\"f\",IF(Schueler10Punkte!$G16>1,\"f\",Schueler10Punkte!$G16)))","v":""},{"$f":"IF(Schueler11Punkte!$D$1=0,\"\",IF(Schueler11Punkte!$G16=\"\",\"f\",IF(Schueler11Punkte!$G16>1,\"f\",Schueler11Punkte!$G16)))","v":""},{"$f":"IF(Schueler12Punkte!$D$1=0,\"\",IF(Schueler12Punkte!$G16=\"\",\"f\",IF(Schueler12Punkte!$G16>1,\"f\",Schueler12Punkte!$G16)))","v":""},{"$f":"IF(Schueler13Punkte!$D$1=0,\"\",IF(Schueler13Punkte!$G16=\"\",\"f\",IF(Schueler13Punkte!$G16>1,\"f\",Schueler13Punkte!$G16)))","v":""},{"$f":"IF(Schueler14Punkte!$D$1=0,\"\",IF(Schueler14Punkte!$G16=\"\",\"f\",IF(Schueler14Punkte!$G16>1,\"f\",Schueler14Punkte!$G16)))","v":""},{"$f":"IF(Schueler15Punkte!$D$1=0,\"\",IF(Schueler15Punkte!$G16=\"\",\"f\",IF(Schueler15Punkte!$G16>1,\"f\",Schueler15Punkte!$G16)))","v":""},{"$f":"IF(Schueler16Punkte!$D$1=0,\"\",IF(Schueler16Punkte!$G16=\"\",\"f\",IF(Schueler16Punkte!$G16>1,\"f\",Schueler16Punkte!$G16)))","v":""},{"$f":"IF(Schueler17Punkte!$D$1=0,\"\",IF(Schueler17Punkte!$G16=\"\",\"f\",IF(Schueler17Punkte!$G16>1,\"f\",Schueler17Punkte!$G16)))","v":""},{"$f":"IF(Schueler18Punkte!$D$1=0,\"\",IF(Schueler18Punkte!$G16=\"\",\"f\",IF(Schueler18Punkte!$G16>1,\"f\",Schueler18Punkte!$G16)))","v":""},{"$f":"IF(Schueler19Punkte!$D$1=0,\"\",IF(Schueler19Punkte!$G16=\"\",\"f\",IF(Schueler19Punkte!$G16>1,\"f\",Schueler19Punkte!$G16)))","v":""},{"$f":"IF(Schueler20Punkte!$D$1=0,\"\",IF(Schueler20Punkte!$G16=\"\",\"f\",IF(Schueler20Punkte!$G16>1,\"f\",Schueler20Punkte!$G16)))","v":""},{"$f":"IF(Schueler21Punkte!$D$1=0,\"\",IF(Schueler21Punkte!$G16=\"\",\"f\",IF(Schueler21Punkte!$G16>1,\"f\",Schueler21Punkte!$G16)))","v":""},{"$f":"IF(Schueler22Punkte!$D$1=0,\"\",IF(Schueler22Punkte!$G16=\"\",\"f\",IF(Schueler22Punkte!$G16>1,\"f\",Schueler22Punkte!$G16)))","v":""},{"$f":"IF(Schueler23Punkte!$D$1=0,\"\",IF(Schueler23Punkte!$G16=\"\",\"f\",IF(Schueler23Punkte!$G16>1,\"f\",Schueler23Punkte!$G16)))","v":""},{"$f":"IF(Schueler24Punkte!$D$1=0,\"\",IF(Schueler24Punkte!$G16=\"\",\"f\",IF(Schueler24Punkte!$G16>1,\"f\",Schueler24Punkte!$G16)))","v":""},{"$f":"IF(Schueler25Punkte!$D$1=0,\"\",IF(Schueler25Punkte!$G16=\"\",\"f\",IF(Schueler25Punkte!$G16>1,\"f\",Schueler25Punkte!$G16)))","v":""},{"$f":"IF(Schueler26Punkte!$D$1=0,\"\",IF(Schueler26Punkte!$G16=\"\",\"f\",IF(Schueler26Punkte!$G16>1,\"f\",Schueler26Punkte!$G16)))","v":""},{"$f":"IF(Schueler27Punkte!$D$1=0,\"\",IF(Schueler27Punkte!$G16=\"\",\"f\",IF(Schueler27Punkte!$G16>1,\"f\",Schueler27Punkte!$G16)))","v":""},{"$f":"IF(Schueler28Punkte!$D$1=0,\"\",IF(Schueler28Punkte!$G16=\"\",\"f\",IF(Schueler28Punkte!$G16>1,\"f\",Schueler28Punkte!$G16)))","v":""},{"$f":"IF(Schueler29Punkte!$D$1=0,\"\",IF(Schueler29Punkte!$G16=\"\",\"f\",IF(Schueler29Punkte!$G16>1,\"f\",Schueler29Punkte!$G16)))","v":""},{"$f":"IF(Schueler30Punkte!$D$1=0,\"\",IF(Schueler30Punkte!$G16=\"\",\"f\",IF(Schueler30Punkte!$G16>1,\"f\",Schueler30Punkte!$G16)))","v":""},{"$f":"COUNTIF(G20:AJ20,1)/(COUNTIF(G20:AJ20,1)+COUNTIF(G20:AJ20,0))","v":{"$error":"#DIV/0!"}}]
[]
[null,null,"LEXIK",null,null,4,{"$f":"IF(OR(G23=\"\",G23=\"f\"),\"\",SUM(G23,G24,G25,G26))","v":""},{"$f":"IF(OR(H23=\"\",H23=\"f\"),\"\",SUM(H23,H24,H25,H26))","v":""},"","","","","","","","","","","","","","","","","","","","","","","","","","","",{"$f":"IF(OR(AJ23=\"\",AJ23=\"f\"),\"\",SUM(AJ23,AJ24,AJ25,AJ26))","v":""}]
[1,"LE13",null,null,null,1,{"$f":"IF(Schueler1Punkte!$D$1=0,\"\",IF(Schueler1Punkte!$G18=\"\",\"f\",IF(Schueler1Punkte!$G18>1,\"f\",Schueler1Punkte!$G18)))","v":""},{"$f":"IF(Schueler2Punkte!$D$1=0,\"\",IF(Schueler2Punkte!$G18=\"\",\"f\",IF(Schueler2Punkte!$G18>1,\"f\",Schueler2Punkte!$G18)))","v":""},{"$f":"IF(Schueler3Punkte!$D$1=0,\"\",IF(Schueler3Punkte!$G18=\"\",\"f\",IF(Schueler3Punkte!$G18>1,\"f\",Schueler3Punkte!$G18)))","v":""},{"$f":"IF(Schueler4Punkte!$D$1=0,\"\",IF(Schueler4Punkte!$G18=\"\",\"f\",IF(Schueler4Punkte!$G18>1,\"f\",Schueler4Punkte!$G18)))","v":""},{"$f":"IF(Schueler5Punkte!$D$1=0,\"\",IF(Schueler5Punkte!$G18=\"\",\"f\",IF(Schueler5Punkte!$G18>1,\"f\",Schueler5Punkte!$G18)))","v":""},{"$f":"IF(Schueler6Punkte!$D$1=0,\"\",IF(Schueler6Punkte!$G18=\"\",\"f\",IF(Schueler6Punkte!$G18>1,\"f\",Schueler6Punkte!$G18)))","v":""},{"$f":"IF(Schueler7Punkte!$D$1=0,\"\",IF(Schueler7Punkte!$G18=\"\",\"f\",IF(Schueler7Punkte!$G18>1,\"f\",Schueler7Punkte!$G18)))","v":""},{"$f":"IF(Schueler8Punkte!$D$1=0,\"\",IF(Schueler8Punkte!$G18=\"\",\"f\",IF(Schueler8Punkte!$G18>1,\"f\",Schueler8Punkte!$G18)))","v":""},{"$f":"IF(Schueler9Punkte!$D$1=0,\"\",IF(Schueler9Punkte!$G18=\"\",\"f\",IF(Schueler9Punkte!$G18>1,\"f\",Schueler9Punkte!$G18)))","v":""},{"$f":"IF(Schueler10Punkte!$D$1=0,\"\",IF(Schueler10Punkte!$G18=\"\",\"f\",IF(Schueler10Punkte!$G18>1,\"f\",Schueler10Punkte!$G18)))","v":""},{"$f":"IF(Schueler11Punkte!$D$1=0,\"\",IF(Schueler11Punkte!$G18=\"\",\"f\",IF(Schueler11Punkte!$G18>1,\"f\",Schueler11Punkte!$G18)))","v":""},{"$f":"IF(Schueler12Punkte!$D$1=0,\"\",IF(Schueler12Punkte!$G18=\"\",\"f\",IF(Schueler12Punkte!$G18>1,\"f\",Schueler12Punkte!$G18)))","v":""},{"$f":"IF(Schueler13Punkte!$D$1=0,\"\",IF(Schueler13Punkte!$G18=\"\",\"f\",IF(Schueler13Punkte!$G18>1,\"f\",Schueler13Punkte!$G18)))","v":""},{"$f":"IF(Schueler14Punkte!$D$1=0,\"\",IF(Schueler14Punkte!$G18=\"\",\"f\",IF(Schueler14Punkte!$G18>1,\"f\",Schueler14Punkte!$G18)))","v":""},{"$f":"IF(Schueler15Punkte!$D$1=0,\"\",IF(Schueler15Punkte!$G18=\"\",\"f\",IF(Schueler15Punkte!$G18>1,\"f\",Schueler15Punkte!$G18)))","v":""},{"$f":"IF(Schueler16Punkte!$D$1=0,\"\",IF(Schueler16Punkte!$G18=\"\",\"f\",IF(Schueler16Punkte!$G18>1,\"f\",Schueler16Punkte!$G18)))","v":""},{"$f":"IF(Schueler17Punkte!$D$1=0,\"\",IF(Schueler17Punkte!$G18=\"\",\"f\",IF(Schueler17Punkte!$G18>1,\"f\",Schueler17Punkte!$G18)))","v":""},{"$f":"IF(Schueler18Punkte!$D$1=0,\"\",IF(Schueler18Punkte!$G18=\"\",\"f\",IF(Schueler18Punkte!$G18>1,\"f\",Schueler18Punkte!$G18)))","v":""},{"$f":"IF(Schueler19Punkte!$D$1=0,\"\",IF(Schueler19Punkte!$G18=\"\",\"f\",IF(Schueler19Punkte!$G18>1,\"f\",Schueler19Punkte!$G18)))","v":""},{"$f":"IF(Schueler20Punkte!$D$1=0,\"\",IF(Schueler20Punkte!$G18=\"\",\"f\",IF(Schueler20Punkte!$G18>1,\"f\",Schueler20Punkte!$G18)))","v":""},{"$f":"IF(Schueler21Punkte!$D$1=0,\"\",IF(Schueler21Punkte!$G18=\"\",\"f\",IF(Schueler21Punkte!$G18>1,\"f\",Schueler21Punkte!$G18)))","v":""},{"$f":"IF(Schueler22Punkte!$D$1=0,\"\",IF(Schueler22Punkte!$G18=\"\",\"f\",IF(Schueler22Punkte!$G18>1,\"f\",Schueler22Punkte!$G18)))","v":""},{"$f":"IF(Schueler23Punkte!$D$1=0,\"\",IF(Schueler23Punkte!$G18=\"\",\"f\",IF(Schueler23Punkte!$G18>1,\"f\",Schueler23Punkte!$G18)))","v":""},{"$f":"IF(Schueler24Punkte!$D$1=0,\"\",IF(Schueler24Punkte!$G18=\"\",\"f\",IF(Schueler24Punkte!$G18>1,\"f\",Schueler24Punkte!$G18)))","v":""},{"$f":"IF(Schueler25Punkte!$D$1=0,\"\",IF(Schueler25Punkte!$G18=\"\",\"f\",IF(Schueler25Punkte!$G18>1,\"f\",Schueler25Punkte!$G18)))","v":""},{"$f":"IF(Schueler26Punkte!$D$1=0,\"\",IF(Schueler26Punkte!$G18=\"\",\"f\",IF(Schueler26Punkte!$G18>1,\"f\",Schueler26Punkte!$G18)))","v":""},{"$f":"IF(Schueler27Punkte!$D$1=0,\"\",IF(Schueler27Punkte!$G18=\"\",\"f\",IF(Schueler27Punkte!$G18>1,\"f\",Schueler27Punkte!$G18)))","v":""},{"$f":"IF(Schueler28Punkte!$D$1=0,\"\",IF(Schueler28Punkte!$G18=\"\",\"f\",IF(Schueler28Punkte!$G18>1,\"f\",Schueler28Punkte!$G18)))","v":""},{"$f":"IF(Schueler29Punkte!$D$1=0,\"\",IF(Schueler29Punkte!$G18=\"\",\"f\",IF(Schueler29Punkte!$G18>1,\"f\",Schueler29Punkte!$G18)))","v":""},{"$f":"IF(Schueler30Punkte!$D$1=0,\"\",IF(Schueler30Punkte!$G18=\"\",\"f\",IF(Schueler30Punkte!$G18>1,\"f\",Schueler30Punkte!$G18)))","v":""},{"$f":"COUNTIF(G23:AJ23,1)/(COUNTIF(G23:AJ23,1)+COUNTIF(G23:AJ23,0))","v":{"$error":"#DIV/0!"}}]
[2,"LE14",null,null,null,1,{"$f":"IF(Schueler1Punkte!$D$1=0,\"\",IF(Schueler1Punkte!$G19=\"\",\"f\",IF(Schueler1Punkte!$G19>1,\"f\",Schueler1Punkte!$G19)))","v":""},{"$f":"IF(Schueler2Punkte!$D$1=0,\"\",IF(Schueler2Punkte!$G19=\"\",\"f\",IF(Schueler2Punkte!$G19>1,\"f\",Schueler2Punkte!$G19)))","v":""},{"$f":"IF(Schueler3Punkte!$D$1=0,\"\",IF(Schueler3Punkte!$G19=\"\",\"f\",IF(Schueler3Punkte!$G19>1,\"f\",Schueler3Punkte!$G19)))","v":""},{"$f":"IF(Schueler4Punkte!$D$1=0,\"\",IF(Schueler4Punkte!$G19=\"\",\"f\",IF(Schueler4Punkte!$G19>1,\"f\",Schueler4Punkte!$G19)))","v":""},{"$f":"IF(Schueler5Punkte!$D$1=0,\"\",IF(Schueler5Punkte!$G19=\"\",\"f\",IF(Schueler5Punkte!$G19>1,\"f\",Schueler5Punkte!$G19)))","v":""},{"$f":"IF(Schueler6Punkte!$D$1=0,\"\",IF(Schueler6Punkte!$G19=\"\",\"f\",IF(Schueler6Punkte!$G19>1,\"f\",Schueler6Punkte!$G19)))","v":""},{"$f":"IF(Schueler7Punkte!$D$1=0,\"\",IF(Schueler7Punkte!$G19=\"\",\"f\",IF(Schueler7Punkte!$G19>1,\"f\",Schueler7Punkte!$G19)))","v":""},{"$f":"IF(Schueler8Punkte!$D$1=0,\"\",IF(Schueler8Punkte!$G19=\"\",\"f\",IF(Schueler8Punkte!$G19>1,\"f\",Schueler8Punkte!$G19)))","v":""},{"$f":"IF(Schueler9Punkte!$D$1=0,\"\",IF(Schueler9Punkte!$G19=\"\",\"f\",IF(Schueler9Punkte!$G19>1,\"f\",Schueler9Punkte!$G19)))","v":""},{"$f":"IF(Schueler10Punkte!$D$1=0,\"\",IF(Schueler10Punkte!$G19=\"\",\"f\",IF(Schueler10Punkte!$G19>1,\"f\",Schueler10Punkte!$G19)))","v":""},{"$f":"IF(Schueler11Punkte!$D$1=0,\"\",IF(Schueler11Punkte!$G19=\"\",\"f\",IF(Schueler11Punkte!$G19>1,\"f\",Schueler11Punkte!$G19)))","v":""},{"$f":"IF(Schueler12Punkte!$D$1=0,\"\",IF(Schueler12Punkte!$G19=\"\",\"f\",IF(Schueler12Punkte!$G19>1,\"f\",Schueler12Punkte!$G19)))","v":""},{"$f":"IF(Schueler13Punkte!$D$1=0,\"\",IF(Schueler13Punkte!$G19=\"\",\"f\",IF(Schueler13Punkte!$G19>1,\"f\",Schueler13Punkte!$G19)))","v":""},{"$f":"IF(Schueler14Punkte!$D$1=0,\"\",IF(Schueler14Punkte!$G19=\"\",\"f\",IF(Schueler14Punkte!$G19>1,\"f\",Schueler14Punkte!$G19)))","v":""},{"$f":"IF(Schueler15Punkte!$D$1=0,\"\",IF(Schueler15Punkte!$G19=\"\",\"f\",IF(Schueler15Punkte!$G19>1,\"f\",Schueler15Punkte!$G19)))","v":""},{"$f":"IF(Schueler16Punkte!$D$1=0,\"\",IF(Schueler16Punkte!$G19=\"\",\"f\",IF(Schueler16Punkte!$G19>1,\"f\",Schueler16Punkte!$G19)))","v":""},{"$f":"IF(Schueler17Punkte!$D$1=0,\"\",IF(Schueler17Punkte!$G19=\"\",\"f\",IF(Schueler17Punkte!$G19>1,\"f\",Schueler17Punkte!$G19)))","v":""},{"$f":"IF(Schueler18Punkte!$D$1=0,\"\",IF(Schueler18Punkte!$G19=\"\",\"f\",IF(Schueler18Punkte!$G19>1,\"f\",Schueler18Punkte!$G19)))","v":""},{"$f":"IF(Schueler19Punkte!$D$1=0,\"\",IF(Schueler19Punkte!$G19=\"\",\"f\",IF(Schueler19Punkte!$G19>1,\"f\",Schueler19Punkte!$G19)))","v":""},{"$f":"IF(Schueler20Punkte!$D$1=0,\"\",IF(Schueler20Punkte!$G19=\"\",\"f\",IF(Schueler20Punkte!$G19>1,\"f\",Schueler20Punkte!$G19)))","v":""},{"$f":"IF(Schueler21Punkte!$D$1=0,\"\",IF(Schueler21Punkte!$G19=\"\",\"f\",IF(Schueler21Punkte!$G19>1,\"f\",Schueler21Punkte!$G19)))","v":""},{"$f":"IF(Schueler22Punkte!$D$1=0,\"\",IF(Schueler22Punkte!$G19=\"\",\"f\",IF(Schueler22Punkte!$G19>1,\"f\",Schueler22Punkte!$G19)))","v":""},{"$f":"IF(Schueler23Punkte!$D$1=0,\"\",IF(Schueler23Punkte!$G19=\"\",\"f\",IF(Schueler23Punkte!$G19>1,\"f\",Schueler23Punkte!$G19)))","v":""},{"$f":"IF(Schueler24Punkte!$D$1=0,\"\",IF(Schueler24Punkte!$G19=\"\",\"f\",IF(Schueler24Punkte!$G19>1,\"f\",Schueler24Punkte!$G19)))","v":""},{"$f":"IF(Schueler25Punkte!$D$1=0,\"\",IF(Schueler25Punkte!$G19=\"\",\"f\",IF(Schueler25Punkte!$G19>1,\"f\",Schueler25Punkte!$G19)))","v":""},{"$f":"IF(Schueler26Punkte!$D$1=0,\"\",IF(Schueler26Punkte!$G19=\"\",\"f\",IF(Schueler26Punkte!$G19>1,\"f\",Schueler26Punkte!$G19)))","v":""},{"$f":"IF(Schueler27Punkte!$D$1=0,\"\",IF(Schueler27Punkte!$G19=\"\",\"f\",IF(Schueler27Punkte!$G19>1,\"f\",Schueler27Punkte!$G19)))","v":""},{"$f":"IF(Schueler28Punkte!$D$1=0,\"\",IF(Schueler28Punkte!$G19=\"\",\"f\",IF(Schueler28Punkte!$G19>1,\"f\",Schueler28Punkte!$G19)))","v":""},{"$f":"IF(Schueler29Punkte!$D$1=0,\"\",IF(Schueler29Punkte!$G19=\"\",\"f\",IF(Schueler29Punkte!$G19>1,\"f\",Schueler29Punkte!$G19)))","v":""},{"$f":"IF(Schueler30Punkte!$D$1=0,\"\",IF(Schueler30Punkte!$G19=\"\",\"f\",IF(Schueler30Punkte!$G19>1,\"f\",Schueler30Punkte!$G19)))","v":""},{"$error":"#DIV/0!"}]
[3,"LE15",null,null,null,1,{"$f":"IF(Schueler1Punkte!$D$1=0,\"\",IF(Schueler1Punkte!$G20=\"\",\"f\",IF(Schueler1Punkte!$G20>1,\"f\",Schueler1Punkte!$G20)))","v":""},{"$f":"IF(Schueler2Punkte!$D$1=0,\"\",IF(Schueler2Punkte!$G20=\"\",\"f\",IF(Schueler2Punkte!$G20>1,\"f\",Schueler2Punkte!$G20)))","v":""},{"$f":"IF(Schueler3Punkte!$D$1=0,\"\",IF(Schueler3Punkte!$G20=\"\",\"f\",IF(Schueler3Punkte!$G20>1,\"f\",Schueler3Punkte!$G20)))","v":""},{"$f":"IF(Schueler4Punkte!$D$1=0,\"\",IF(Schueler4Punkte!$G20=\"\",\"f\",IF(Schueler4Punkte!$G20>1,\"f\",Schueler4Punkte!$G20)))","v":""},{"$f":"IF(Schueler5Punkte!$D$1=0,\"\",IF(Schueler5Punkte!$G20=\"\",\"f\",IF(Schueler5Punkte!$G20>1,\"f\",Schueler5Punkte!$G20)))","v":""},{"$f":"IF(Schueler6Punkte!$D$1=0,\"\",IF(Schueler6Punkte!$G20=\"\",\"f\",IF(Schueler6Punkte!$G20>1,\"f\",Schueler6Punkte!$G20)))","v":""},{"$f":"IF(Schueler7Punkte!$D$1=0,\"\",IF(Schueler7Punkte!$G20=\"\",\"f\",IF(Schueler7Punkte!$G20>1,\"f\",Schueler7Punkte!$G20)))","v":""},{"$f":"IF(Schueler8Punkte!$D$1=0,\"\",IF(Schueler8Punkte!$G20=\"\",\"f\",IF(Schueler8Punkte!$G20>1,\"f\",Schueler8Punkte!$G20)))","v":""},{"$f":"IF(Schueler9Punkte!$D$1=0,\"\",IF(Schueler9Punkte!$G20=\"\",\"f\",IF(Schueler9Punkte!$G20>1,\"f\",Schueler9Punkte!$G20)))","v":""},{"$f":"IF(Schueler10Punkte!$D$1=0,\"\",IF(Schueler10Punkte!$G20=\"\",\"f\",IF(Schueler10Punkte!$G20>1,\"f\",Schueler10Punkte!$G20)))","v":""},{"$f":"IF(Schueler11Punkte!$D$1=0,\"\",IF(Schueler11Punkte!$G20=\"\",\"f\",IF(Schueler11Punkte!$G20>1,\"f\",Schueler11Punkte!$G20)))","v":""},{"$f":"IF(Schueler12Punkte!$D$1=0,\"\",IF(Schueler12Punkte!$G20=\"\",\"f\",IF(Schueler12Punkte!$G20>1,\"f\",Schueler12Punkte!$G20)))","v":""},{"$f":"IF(Schueler13Punkte!$D$1=0,\"\",IF(Schueler13Punkte!$G20=\"\",\"f\",IF(Schueler13Punkte!$G20>1,\"f\",Schueler13Punkte!$G20)))","v":""},{"$f":"IF(Schueler14Punkte!$D$1=0,\"\",IF(Schueler14Punkte!$G20=\"\",\"f\",IF(Schueler14Punkte!$G20>1,\"f\",Schueler14Punkte!$G20)))","v":""},{"$f":"IF(Schueler15Punkte!$D$1=0,\"\",IF(Schueler15Punkte!$G20=\"\",\"f\",IF(Schueler15Punkte!$G20>1,\"f\",Schueler15Punkte!$G20)))","v":""},{"$f":"IF(Schueler16Punkte!$D$1=0,\"\",IF(Schueler16Punkte!$G20=\"\",\"f\",IF(Schueler16Punkte!$G20>1,\"f\",Schueler16Punkte!$G20)))","v":""},{"$f":"IF(Schueler17Punkte!$D$1=0,\"\",IF(Schueler17Punkte!$G20=\"\",\"f\",IF(Schueler17Punkte!$G20>1,\"f\",Schueler17Punkte!$G20)))","v":""},{"$f":"IF(Schueler18Punkte!$D$1=0,\"\",IF(Schueler18Punkte!$G20=\"\",\"f\",IF(Schueler18Punkte!$G20>1,\"f\",Schueler18Punkte!$G20)))","v":""},{"$f":"IF(Schueler19Punkte!$D$1=0,\"\",IF(Schueler19Punkte!$G20=\"\",\"f\",IF(Schueler19Punkte!$G20>1,\"f\",Schueler19Punkte!$G20)))","v":""},{"$f":"IF(Schueler20Punkte!$D$1=0,\"\",IF(Schueler20Punkte!$G20=\"\",\"f\",IF(Schueler20Punkte!$G20>1,\"f\",Schueler20Punkte!$G20)))","v":""},{"$f":"IF(Schueler21Punkte!$D$1=0,\"\",IF(Schueler21Punkte!$G20=\"\",\"f\",IF(Schueler21Punkte!$G20>1,\"f\",Schueler21Punkte!$G20)))","v":""},{"$f":"IF(Schueler22Punkte!$D$1=0,\"\",IF(Schueler22Punkte!$G20=\"\",\"f\",IF(Schueler22Punkte!$G20>1,\"f\",Schueler22Punkte!$G20)))","v":""},{"$f":"IF(Schueler23Punkte!$D$1=0,\"\",IF(Schueler23Punkte!$G20=\"\",\"f\",IF(Schueler23Punkte!$G20>1,\"f\",Schueler23Punkte!$G20)))","v":""},{"$f":"IF(Schueler24Punkte!$D$1=0,\"\",IF(Schueler24Punkte!$G20=\"\",\"f\",IF(Schueler24Punkte!$G20>1,\"f\",Schueler24Punkte!$G20)))","v":""},{"$f":"IF(Schueler25Punkte!$D$1=0,\"\",IF(Schueler25Punkte!$G20=\"\",\"f\",IF(Schueler25Punkte!$G20>1,\"f\",Schueler25Punkte!$G20)))","v":""},{"$f":"IF(Schueler26Punkte!$D$1=0,\"\",IF(Schueler26Punkte!$G20=\"\",\"f\",IF(Schueler26Punkte!$G20>1,\"f\",Schueler26Punkte!$G20)))","v":""},{"$f":"IF(Schueler27Punkte!$D$1=0,\"\",IF(Schueler27Punkte!$G20=\"\",\"f\",IF(Schueler27Punkte!$G20>1,\"f\",Schueler27Punkte!$G20)))","v":""},{"$f":"IF(Schueler28Punkte!$D$1=0,\"\",IF(Schueler28Punkte!$G20=\"\",\"f\",IF(Schueler28Punkte!$G20>1,\"f\",Schueler28Punkte!$G20)))","v":""},{"$f":"IF(Schueler29Punkte!$D$1=0,\"\",IF(Schueler29Punkte!$G20=\"\",\"f\",IF(Schueler29Punkte!$G20>1,\"f\",Schueler29Punkte!$G20)))","v":""},{"$f":"IF(Schueler30Punkte!$D$1=0,\"\",IF(Schueler30Punkte!$G20=\"\",\"f\",IF(Schueler30Punkte!$G20>1,\"f\",Schueler30Punkte!$G20)))","v":""},{"$error":"#DIV/0!"}]
[4,"LE16",null,null,null,1,{"$f":"IF(Schueler1Punkte!$D$1=0,\"\",IF(Schueler1Punkte!$G21=\"\",\"f\",IF(Schueler1Punkte!$G21>1,\"f\",Schueler1Punkte!$G21)))","v":""},{"$f":"IF(Schueler2Punkte!$D$1=0,\"\",IF(Schueler2Punkte!$G21=\"\",\"f\",IF(Schueler2Punkte!$G21>1,\"f\",Schueler2Punkte!$G21)))","v":""},{"$f":"IF(Schueler3Punkte!$D$1=0,\"\",IF(Schueler3Punkte!$G21=\"\",\"f\",IF(Schueler3Punkte!$G21>1,\"f\",Schueler3Punkte!$G21)))","v":""},{"$f":"IF(Schueler4Punkte!$D$1=0,\"\",IF(Schueler4Punkte!$G21=\"\",\"f\",IF(Schueler4Punkte!$G21>1,\"f\",Schueler4Punkte!$G21)))","v":""},{"$f":"IF(Schueler5Punkte!$D$1=0,\"\",IF(Schueler5Punkte!$G21=\"\",\"f\",IF(Schueler5Punkte!$G21>1,\"f\",Schueler5Punkte!$G21)))","v":""},{"$f":"IF(Schueler6Punkte!$D$1=0,\"\",IF(Schueler6Punkte!$G21=\"\",\"f\",IF(Schueler6Punkte!$G21>1,\"f\",Schueler6Punkte!$G21)))","v":""},{"$f":"IF(Schueler7Punkte!$D$1=0,\"\",IF(Schueler7Punkte!$G21=\"\",\"f\",IF(Schueler7Punkte!$G21>1,\"f\",Schueler7Punkte!$G21)))","v":""},{"$f":"IF(Schueler8Punkte!$D$1=0,\"\",IF(Schueler8Punkte!$G21=\"\",\"f\",IF(Schueler8Punkte!$G21>1,\"f\",Schueler8Punkte!$G21)))","v":""},{"$f":"IF(Schueler9Punkte!$D$1=0,\"\",IF(Schueler9Punkte!$G21=\"\",\"f\",IF(Schueler9Punkte!$G21>1,\"f\",Schueler9Punkte!$G21)))","v":""},{"$f":"IF(Schueler10Punkte!$D$1=0,\"\",IF(Schueler10Punkte!$G21=\"\",\"f\",IF(Schueler10Punkte!$G21>1,\"f\",Schueler10Punkte!$G21)))","v":""},{"$f":"IF(Schueler11Punkte!$D$1=0,\"\",IF(Schueler11Punkte!$G21=\"\",\"f\",IF(Schueler11Punkte!$G21>1,\"f\",Schueler11Punkte!$G21)))","v":""},{"$f":"IF(Schueler12Punkte!$D$1=0,\"\",IF(Schueler12Punkte!$G21=\"\",\"f\",IF(Schueler12Punkte!$G21>1,\"f\",Schueler12Punkte!$G21)))","v":""},{"$f":"IF(Schueler13Punkte!$D$1=0,\"\",IF(Schueler13Punkte!$G21=\"\",\"f\",IF(Schueler13Punkte!$G21>1,\"f\",Schueler13Punkte!$G21)))","v":""},{"$f":"IF(Schueler14Punkte!$D$1=0,\"\",IF(Schueler14Punkte!$G21=\"\",\"f\",IF(Schueler14Punkte!$G21>1,\"f\",Schueler14Punkte!$G21)))","v":""},{"$f":"IF(Schueler15Punkte!$D$1=0,\"\",IF(Schueler15Punkte!$G21=\"\",\"f\",IF(Schueler15Punkte!$G21>1,\"f\",Schueler15Punkte!$G21)))","v":""},{"$f":"IF(Schueler16Punkte!$D$1=0,\"\",IF(Schueler16Punkte!$G21=\"\",\"f\",IF(Schueler16Punkte!$G21>1,\"f\",Schueler16Punkte!$G21)))","v":""},{"$f":"IF(Schueler17Punkte!$D$1=0,\"\",IF(Schueler17Punkte!$G21=\"\",\"f\",IF(Schueler17Punkte!$G21>1,\"f\",Schueler17Punkte!$G21)))","v":""},{"$f":"IF(Schueler18Punkte!$D$1=0,\"\",IF(Schueler18Punkte!$G21=\"\",\"f\",IF(Schueler18Punkte!$G21>1,\"f\",Schueler18Punkte!$G21)))","v":""},{"$f":"IF(Schueler19Punkte!$D$1=0,\"\",IF(Schueler19Punkte!$G21=\"\",\"f\",IF(Schueler19Punkte!$G21>1,\"f\",Schueler19Punkte!$G21)))","v":""},{"$f":"IF(Schueler20Punkte!$D$1=0,\"\",IF(Schueler20Punkte!$G21=\"\",\"f\",IF(Schueler20Punkte!$G21>1,\"f\",Schueler20Punkte!$G21)))","v":""},{"$f":"IF(Schueler21Punkte!$D$1=0,\"\",IF(Schueler21Punkte!$G21=\"\",\"f\",IF(Schueler21Punkte!$G21>1,\"f\",Schueler21Punkte!$G21)))","v":""},{"$f":"IF(Schueler22Punkte!$D$1=0,\"\",IF(Schueler22Punkte!$G21=\"\",\"f\",IF(Schueler22Punkte!$G21>1,\"f\",Schueler22Punkte!$G21)))","v":""},{"$f":"IF(Schueler23Punkte!$D$1=0,\"\",IF(Schueler23Punkte!$G21=\"\",\"f\",IF(Schueler23Punkte!$G21>1,\"f\",Schueler23Punkte!$G21)))","v":""},{"$f":"IF(Schueler24Punkte!$D$1=0,\"\",IF(Schueler24Punkte!$G21=\"\",\"f\",IF(Schueler24Punkte!$G21>1,\"f\",Schueler24Punkte!$G21)))","v":""},{"$f":"IF(Schueler25Punkte!$D$1=0,\"\",IF(Schueler25Punkte!$G21=\"\",\"f\",IF(Schueler25Punkte!$G21>1,\"f\",Schueler25Punkte!$G21)))","v":""},{"$f":"IF(Schueler26Punkte!$D$1=0,\"\",IF(Schueler26Punkte!$G21=\"\",\"f\",IF(Schueler26Punkte!$G21>1,\"f\",Schueler26Punkte!$G21)))","v":""},{"$f":"IF(Schueler27Punkte!$D$1=0,\"\",IF(Schueler27Punkte!$G21=\"\",\"f\",IF(Schueler27Punkte!$G21>1,\"f\",Schueler27Punkte!$G21)))","v":""},{"$f":"IF(Schueler28Punkte!$D$1=0,\"\",IF(Schueler28Punkte!$G21=\"\",\"f\",IF(Schueler28Punkte!$G21>1,\"f\",Schueler28Punkte!$G21)))","v":""},{"$f":"IF(Schueler29Punkte!$D$1=0,\"\",IF(Schueler29Punkte!$G21=\"\",\"f\",IF(Schueler29Punkte!$G21>1,\"f\",Schueler29Punkte!$G21)))","v":""},{"$f":"IF(Schueler30Punkte!$D$1=0,\"\",IF(Schueler30Punkte!$G21=\"\",\"f\",IF(Schueler30Punkte!$G21>1,\"f\",Schueler30Punkte!$G21)))","v":""},{"$error":"#DIV/0!"}]
[null,null,"MORPHOLOGIE",null,null,4,{"$f":"IF(OR(G28=\"\",G28=\"f\"),\"\",SUM(G28+G29+G30+G31))","v":""},{"$f":"IF(OR(H28=\"\",H28=\"f\"),\"\",SUM(H28+H29+H30+H31))","v":""},"","","","","","","","","","","","","","","","","","","","","","","","","","","",""]
[1,"MO19",null,null,null,1,{"$f":"IF(Schueler1Punkte!$D$1=0,\"\",IF(Schueler1Punkte!$G22=\"\",\"f\",IF(Schueler1Punkte!$G22>1,\"f\",Schueler1Punkte!$G22)))","v":""},{"$f":"IF(Schueler2Punkte!$D$1=0,\"\",IF(Schueler2Punkte!$G22=\"\",\"f\",IF(Schueler2Punkte!$G22>1,\"f\",Schueler2Punkte!$G22)))","v":""},{"$f":"IF(Schueler3Punkte!$D$1=0,\"\",IF(Schueler3Punkte!$G22=\"\",\"f\",IF(Schueler3Punkte!$G22>1,\"f\",Schueler3Punkte!$G22)))","v":""},{"$f":"IF(Schueler4Punkte!$D$1=0,\"\",IF(Schueler4Punkte!$G22=\"\",\"f\",IF(Schueler4Punkte!$G22>1,\"f\",Schueler4Punkte!$G22)))","v":""},{"$f":"IF(Schueler5Punkte!$D$1=0,\"\",IF(Schueler5Punkte!$G22=\"\",\"f\",IF(Schueler5Punkte!$G22>1,\"f\",Schueler5Punkte!$G22)))","v":""},{"$f":"IF(Schueler6Punkte!$D$1=0,\"\",IF(Schueler6Punkte!$G22=\"\",\"f\",IF(Schueler6Punkte!$G22>1,\"f\",Schueler6Punkte!$G22)))","v":""},{"$f":"IF(Schueler7Punkte!$D$1=0,\"\",IF(Schueler7Punkte!$G22=\"\",\"f\",IF(Schueler7Punkte!$G22>1,\"f\",Schueler7Punkte!$G22)))","v":""},{"$f":"IF(Schueler8Punkte!$D$1=0,\"\",IF(Schueler8Punkte!$G22=\"\",\"f\",IF(Schueler8Punkte!$G22>1,\"f\",Schueler8Punkte!$G22)))","v":""},{"$f":"IF(Schueler9Punkte!$D$1=0,\"\",IF(Schueler9Punkte!$G22=\"\",\"f\",IF(Schueler9Punkte!$G22>1,\"f\",Schueler9Punkte!$G22)))","v":""},{"$f":"IF(Schueler10Punkte!$D$1=0,\"\",IF(Schueler10Punkte!$G22=\"\",\"f\",IF(Schueler10Punkte!$G22>1,\"f\",Schueler10Punkte!$G22)))","v":""},{"$f":"IF(Schueler11Punkte!$D$1=0,\"\",IF(Schueler11Punkte!$G22=\"\",\"f\",IF(Schueler11Punkte!$G22>1,\"f\",Schueler11Punkte!$G22)))","v":""},{"$f":"IF(Schueler12Punkte!$D$1=0,\"\",IF(Schueler12Punkte!$G22=\"\",\"f\",IF(Schueler12Punkte!$G22>1,\"f\",Schueler12Punkte!$G22)))","v":""},{"$f":"IF(Schueler13Punkte!$D$1=0,\"\",IF(Schueler13Punkte!$G22=\"\",\"f\",IF(Schueler13Punkte!$G22>1,\"f\",Schueler13Punkte!$G22)))","v":""},{"$f":"IF(Schueler14Punkte!$D$1=0,\"\",IF(Schueler14Punkte!$G22=\"\",\"f\",IF(Schueler14Punkte!$G22>1,\"f\",Schueler14Punkte!$G22)))","v":""},{"$f":"IF(Schueler15Punkte!$D$1=0,\"\",IF(Schueler15Punkte!$G22=\"\",\"f\",IF(Schueler15Punkte!$G22>1,\"f\",Schueler15Punkte!$G22)))","v":""},{"$f":"IF(Schueler16Punkte!$D$1=0,\"\",IF(Schueler16Punkte!$G22=\"\",\"f\",IF(Schueler16Punkte!$G22>1,\"f\",Schueler16Punkte!$G22)))","v":""},{"$f":"IF(Schueler17Punkte!$D$1=0,\"\",IF(Schueler17Punkte!$G22=\"\",\"f\",IF(Schueler17Punkte!$G22>1,\"f\",Schueler17Punkte!$G22)))","v":""},{"$f":"IF(Schueler18Punkte!$D$1=0,\"\",IF(Schueler18Punkte!$G22=\"\",\"f\",IF(Schueler18Punkte!$G22>1,\"f\",Schueler18Punkte!$G22)))","v":""},{"$f":"IF(Schueler19Punkte!$D$1=0,\"\",IF(Schueler19Punkte!$G22=\"\",\"f\",IF(Schueler19Punkte!$G22>1,\"f\",Schueler19Punkte!$G22)))","v":""},{"$f":"IF(Schueler20Punkte!$D$1=0,\"\",IF(Schueler20Punkte!$G22=\"\",\"f\",IF(Schueler20Punkte!$G22>1,\"f\",Schueler20Punkte!$G22)))","v":""},{"$f":"IF(Schueler21Punkte!$D$1=0,\"\",IF(Schueler21Punkte!$G22=\"\",\"f\",IF(Schueler21Punkte!$G22>1,\"f\",Schueler21Punkte!$G22)))","v":""},{"$f":"IF(Schueler22Punkte!$D$1=0,\"\",IF(Schueler22Punkte!$G22=\"\",\"f\",IF(Schueler22Punkte!$G22>1,\"f\",Schueler22Punkte!$G22)))","v":""},{"$f":"IF(Schueler23Punkte!$D$1=0,\"\",IF(Schueler23Punkte!$G22=\"\",\"f\",IF(Schueler23Punkte!$G22>1,\"f\",Schueler23Punkte!$G22)))","v":""},{"$f":"IF(Schueler24Punkte!$D$1=0,\"\",IF(Schueler24Punkte!$G22=\"\",\"f\",IF(Schueler24Punkte!$G22>1,\"f\",Schueler24Punkte!$G22)))","v":""},{"$f":"IF(Schueler25Punkte!$D$1=0,\"\",IF(Schueler25Punkte!$G22=\"\",\"f\",IF(Schueler25Punkte!$G22>1,\"f\",Schueler25Punkte!$G22)))","v":""},{"$f":"IF(Schueler26Punkte!$D$1=0,\"\",IF(Schueler26Punkte!$G22=\"\",\"f\",IF(Schueler26Punkte!$G22>1,\"f\",Schueler26Punkte!$G22)))","v":""},{"$f":"IF(Schueler27Punkte!$D$1=0,\"\",IF(Schueler27Punkte!$G22=\"\",\"f\",IF(Schueler27Punkte!$G22>1,\"f\",Schueler27Punkte!$G22)))","v":""},{"$f":"IF(Schueler28Punkte!$D$1=0,\"\",IF(Schueler28Punkte!$G22=\"\",\"f\",IF(Schueler28Punkte!$G22>1,\"f\",Schueler28Punkte!$G22)))","v":""},{"$f":"IF(Schueler29Punkte!$D$1=0,\"\",IF(Schueler29Punkte!$G22=\"\",\"f\",IF(Schueler29Punkte!$G22>1,\"f\",Schueler29Punkte!$G22)))","v":""},{"$f":"IF(Schueler30Punkte!$D$1=0,\"\",IF(Schueler30Punkte!$G22=\"\",\"f\",IF(Schueler30Punkte!$G22>1,\"f\",Schueler30Punkte!$G22)))","v":""},{"$error":"#DIV/0!"}]
[2,"MO20",null,null,null,1,{"$f":"IF(Schueler1Punkte!$D$1=0,\"\",IF(Schueler1Punkte!$G23=\"\",\"f\",IF(Schueler1Punkte!$G23>1,\"f\",Schueler1Punkte!$G23)))","v":""},{"$f":"IF(Schueler2Punkte!$D$1=0,\"\",IF(Schueler2Punkte!$G23=\"\",\"f\",IF(Schueler2Punkte!$G23>1,\"f\",Schueler2Punkte!$G23)))","v":""},{"$f":"IF(Schueler3Punkte!$D$1=0,\"\",IF(Schueler3Punkte!$G23=\"\",\"f\",IF(Schueler3Punkte!$G23>1,\"f\",Schueler3Punkte!$G23)))","v":""},{"$f":"IF(Schueler4Punkte!$D$1=0,\"\",IF(Schueler4Punkte!$G23=\"\",\"f\",IF(Schueler4Punkte!$G23>1,\"f\",Schueler4Punkte!$G23)))","v":""},{"$f":"IF(Schueler5Punkte!$D$1=0,\"\",IF(Schueler5Punkte!$G23=\"\",\"f\",IF(Schueler5Punkte!$G23>1,\"f\",Schueler5Punkte!$G23)))","v":""},{"$f":"IF(Schueler6Punkte!$D$1=0,\"\",IF(Schueler6Punkte!$G23=\"\",\"f\",IF(Schueler6Punkte!$G23>1,\"f\",Schueler6Punkte!$G23)))","v":""},{"$f":"IF(Schueler7Punkte!$D$1=0,\"\",IF(Schueler7Punkte!$G23=\"\",\"f\",IF(Schueler7Punkte!$G23>1,\"f\",Schueler7Punkte!$G23)))","v":""},{"$f":"IF(Schueler8Punkte!$D$1=0,\"\",IF(Schueler8Punkte!$G23=\"\",\"f\",IF(Schueler8Punkte!$G23>1,\"f\",Schueler8Punkte!$G23)))","v":""},{"$f":"IF(Schueler9Punkte!$D$1=0,\"\",IF(Schueler9Punkte!$G23=\"\",\"f\",IF(Schueler9Punkte!$G23>1,\"f\",Schueler9Punkte!$G23)))","v":""},{"$f":"IF(Schueler10Punkte!$D$1=0,\"\",IF(Schueler10Punkte!$G23=\"\",\"f\",IF(Schueler10Punkte!$G23>1,\"f\",Schueler10Punkte!$G23)))","v":""},{"$f":"IF(Schueler11Punkte!$D$1=0,\"\",IF(Schueler11Punkte!$G23=\"\",\"f\",IF(Schueler11Punkte!$G23>1,\"f\",Schueler11Punkte!$G23)))","v":""},{"$f":"IF(Schueler12Punkte!$D$1=0,\"\",IF(Schueler12Punkte!$G23=\"\",\"f\",IF(Schueler12Punkte!$G23>1,\"f\",Schueler12Punkte!$G23)))","v":""},{"$f":"IF(Schueler13Punkte!$D$1=0,\"\",IF(Schueler13Punkte!$G23=\"\",\"f\",IF(Schueler13Punkte!$G23>1,\"f\",Schueler13Punkte!$G23)))","v":""},{"$f":"IF(Schueler14Punkte!$D$1=0,\"\",IF(Schueler14Punkte!$G23=\"\",\"f\",IF(Schueler14Punkte!$G23>1,\"f\",Schueler14Punkte!$G23)))","v":""},{"$f":"IF(Schueler15Punkte!$D$1=0,\"\",IF(Schueler15Punkte!$G23=\"\",\"f\",IF(Schueler15Punkte!$G23>1,\"f\",Schueler15Punkte!$G23)))","v":""},{"$f":"IF(Schueler16Punkte!$D$1=0,\"\",IF(Schueler16Punkte!$G23=\"\",\"f\",IF(Schueler16Punkte!$G23>1,\"f\",Schueler16Punkte!$G23)))","v":""},{"$f":"IF(Schueler17Punkte!$D$1=0,\"\",IF(Schueler17Punkte!$G23=\"\",\"f\",IF(Schueler17Punkte!$G23>1,\"f\",Schueler17Punkte!$G23)))","v":""},{"$f":"IF(Schueler18Punkte!$D$1=0,\"\",IF(Schueler18Punkte!$G23=\"\",\"f\",IF(Schueler18Punkte!$G23>1,\"f\",Schueler18Punkte!$G23)))","v":""},{"$f":"IF(Schueler19Punkte!$D$1=0,\"\",IF(Schueler19Punkte!$G23=\"\",\"f\",IF(Schueler19Punkte!$G23>1,\"f\",Schueler19Punkte!$G23)))","v":""},{"$f":"IF(Schueler20Punkte!$D$1=0,\"\",IF(Schueler20Punkte!$G23=\"\",\"f\",IF(Schueler20Punkte!$G23>1,\"f\",Schueler20Punkte!$G23)))","v":""},{"$f":"IF(Schueler21Punkte!$D$1=0,\"\",IF(Schueler21Punkte!$G23=\"\",\"f\",IF(Schueler21Punkte!$G23>1,\"f\",Schueler21Punkte!$G23)))","v":""},{"$f":"IF(Schueler22Punkte!$D$1=0,\"\",IF(Schueler22Punkte!$G23=\"\",\"f\",IF(Schueler22Punkte!$G23>1,\"f\",Schueler22Punkte!$G23)))","v":""},{"$f":"IF(Schueler23Punkte!$D$1=0,\"\",IF(Schueler23Punkte!$G23=\"\",\"f\",IF(Schueler23Punkte!$G23>1,\"f\",Schueler23Punkte!$G23)))","v":""},{"$f":"IF(Schueler24Punkte!$D$1=0,\"\",IF(Schueler24Punkte!$G23=\"\",\"f\",IF(Schueler24Punkte!$G23>1,\"f\",Schueler24Punkte!$G23)))","v":""},{"$f":"IF(Schueler25Punkte!$D$1=0,\"\",IF(Schueler25Punkte!$G23=\"\",\"f\",IF(Schueler25Punkte!$G23>1,\"f\",Schueler25Punkte!$G23)))","v":""},{"$f":"IF(Schueler26Punkte!$D$1=0,\"\",IF(Schueler26Punkte!$G23=\"\",\"f\",IF(Schueler26Punkte!$G23>1,\"f\",Schueler26Punkte!$G23)))","v":""},{"$f":"IF(Schueler27Punkte!$D$1=0,\"\",IF(Schueler27Punkte!$G23=\"\",\"f\",IF(Schueler27Punkte!$G23>1,\"f\",Schueler27Punkte!$G23)))","v":""},{"$f":"IF(Schueler28Punkte!$D$1=0,\"\",IF(Schueler28Punkte!$G23=\"\",\"f\",IF(Schueler28Punkte!$G23>1,\"f\",Schueler28Punkte!$G23)))","v":""},{"$f":"IF(Schueler29Punkte!$D$1=0,\"\",IF(Schueler29Punkte!$G23=\"\",\"f\",IF(Schueler29Punkte!$G23>1,\"f\",Schueler29Punkte!$G23)))","v":""},{"$f":"IF(Schueler30Punkte!$D$1=0,\"\",IF(Schueler30Punkte!$G23=\"\",\"f\",IF(Schueler30Punkte!$G23>1,\"f\",Schueler30Punkte!$G23)))","v":""},{"$error":"#DIV/0!"}]
[3,"MO21",null,null,null,1,{"$f":"IF(Schueler1Punkte!$D$1=0,\"\",IF(Schueler1Punkte!$G24=\"\",\"f\",IF(Schueler1Punkte!$G24>1,\"f\",Schueler1Punkte!$G24)))","v":""},{"$f":"IF(Schueler2Punkte!$D$1=0,\"\",IF(Schueler2Punkte!$G24=\"\",\"f\",IF(Schueler2Punkte!$G24>1,\"f\",Schueler2Punkte!$G24)))","v":""},{"$f":"IF(Schueler3Punkte!$D$1=0,\"\",IF(Schueler3Punkte!$G24=\"\",\"f\",IF(Schueler3Punkte!$G24>1,\"f\",Schueler3Punkte!$G24)))","v":""},{"$f":"IF(Schueler4Punkte!$D$1=0,\"\",IF(Schueler4Punkte!$G24=\"\",\"f\",IF(Schueler4Punkte!$G24>1,\"f\",Schueler4Punkte!$G24)))","v":""},{"$f":"IF(Schueler5Punkte!$D$1=0,\"\",IF(Schueler5Punkte!$G24=\"\",\"f\",IF(Schueler5Punkte!$G24>1,\"f\",Schueler5Punkte!$G24)))","v":""},{"$f":"IF(Schueler6Punkte!$D$1=0,\"\",IF(Schueler6Punkte!$G24=\"\",\"f\",IF(Schueler6Punkte!$G24>1,\"f\",Schueler6Punkte!$G24)))","v":""},{"$f":"IF(Schueler7Punkte!$D$1=0,\"\",IF(Schueler7Punkte!$G24=\"\",\"f\",IF(Schueler7Punkte!$G24>1,\"f\",Schueler7Punkte!$G24)))","v":""},{"$f":"IF(Schueler8Punkte!$D$1=0,\"\",IF(Schueler8Punkte!$G24=\"\",\"f\",IF(Schueler8Punkte!$G24>1,\"f\",Schueler8Punkte!$G24)))","v":""},{"$f":"IF(Schueler9Punkte!$D$1=0,\"\",IF(Schueler9Punkte!$G24=\"\",\"f\",IF(Schueler9Punkte!$G24>1,\"f\",Schueler9Punkte!$G24)))","v":""},{"$f":"IF(Schueler10Punkte!$D$1=0,\"\",IF(Schueler10Punkte!$G24=\"\",\"f\",IF(Schueler10Punkte!$G24>1,\"f\",Schueler10Punkte!$G24)))","v":""},{"$f":"IF(Schueler11Punkte!$D$1=0,\"\",IF(Schueler11Punkte!$G24=\"\",\"f\",IF(Schueler11Punkte!$G24>1,\"f\",Schueler11Punkte!$G24)))","v":""},{"$f":"IF(Schueler12Punkte!$D$1=0,\"\",IF(Schueler12Punkte!$G24=\"\",\"f\",IF(Schueler12Punkte!$G24>1,\"f\",Schueler12Punkte!$G24)))","v":""},{"$f":"IF(Schueler13Punkte!$D$1=0,\"\",IF(Schueler13Punkte!$G24=\"\",\"f\",IF(Schueler13Punkte!$G24>1,\"f\",Schueler13Punkte!$G24)))","v":""},{"$f":"IF(Schueler14Punkte!$D$1=0,\"\",IF(Schueler14Punkte!$G24=\"\",\"f\",IF(Schueler14Punkte!$G24>1,\"f\",Schueler14Punkte!$G24)))","v":""},{"$f":"IF(Schueler15Punkte!$D$1=0,\"\",IF(Schueler15Punkte!$G24=\"\",\"f\",IF(Schueler15Punkte!$G24>1,\"f\",Schueler15Punkte!$G24)))","v":""},{"$f":"IF(Schueler16Punkte!$D$1=0,\"\",IF(Schueler16Punkte!$G24=\"\",\"f\",IF(Schueler16Punkte!$G24>1,\"f\",Schueler16Punkte!$G24)))","v":""},{"$f":"IF(Schueler17Punkte!$D$1=0,\"\",IF(Schueler17Punkte!$G24=\"\",\"f\",IF(Schueler17Punkte!$G24>1,\"f\",Schueler17Punkte!$G24)))","v":""},{"$f":"IF(Schueler18Punkte!$D$1=0,\"\",IF(Schueler18Punkte!$G24=\"\",\"f\",IF(Schueler18Punkte!$G24>1,\"f\",Schueler18Punkte!$G24)))","v":""},{"$f":"IF(Schueler19Punkte!$D$1=0,\"\",IF(Schueler19Punkte!$G24=\"\",\"f\",IF(Schueler19Punkte!$G24>1,\"f\",Schueler19Punkte!$G24)))","v":""},{"$f":"IF(Schueler20Punkte!$D$1=0,\"\",IF(Schueler20Punkte!$G24=\"\",\"f\",IF(Schueler20Punkte!$G24>1,\"f\",Schueler20Punkte!$G24)))","v":""},{"$f":"IF(Schueler21Punkte!$D$1=0,\"\",IF(Schueler21Punkte!$G24=\"\",\"f\",IF(Schueler21Punkte!$G24>1,\"f\",Schueler21Punkte!$G24)))","v":""},{"$f":"IF(Schueler22Punkte!$D$1=0,\"\",IF(Schueler22Punkte!$G24=\"\",\"f\",IF(Schueler22Punkte!$G24>1,\"f\",Schueler22Punkte!$G24)))","v":""},{"$f":"IF(Schueler23Punkte!$D$1=0,\"\",IF(Schueler23Punkte!$G24=\"\",\"f\",IF(Schueler23Punkte!$G24>1,\"f\",Schueler23Punkte!$G24)))","v":""},{"$f":"IF(Schueler24Punkte!$D$1=0,\"\",IF(Schueler24Punkte!$G24=\"\",\"f\",IF(Schueler24Punkte!$G24>1,\"f\",Schueler24Punkte!$G24)))","v":""},{"$f":"IF(Schueler25Punkte!$D$1=0,\"\",IF(Schueler25Punkte!$G24=\"\",\"f\",IF(Schueler25Punkte!$G24>1,\"f\",Schueler25Punkte!$G24)))","v":""},{"$f":"IF(Schueler26Punkte!$D$1=0,\"\",IF(Schueler26Punkte!$G24=\"\",\"f\",IF(Schueler26Punkte!$G24>1,\"f\",Schueler26Punkte!$G24)))","v":""},{"$f":"IF(Schueler27Punkte!$D$1=0,\"\",IF(Schueler27Punkte!$G24=\"\",\"f\",IF(Schueler27Punkte!$G24>1,\"f\",Schueler27Punkte!$G24)))","v":""},{"$f":"IF(Schueler28Punkte!$D$1=0,\"\",IF(Schueler28Punkte!$G24=\"\",\"f\",IF(Schueler28Punkte!$G24>1,\"f\",Schueler28Punkte!$G24)))","v":""},{"$f":"IF(Schueler29Punkte!$D$1=0,\"\",IF(Schueler29Punkte!$G24=\"\",\"f\",IF(Schueler29Punkte!$G24>1,\"f\",Schueler29Punkte!$G24)))","v":""},{"$f":"IF(Schueler30Punkte!$D$1=0,\"\",IF(Schueler30Punkte!$G24=\"\",\"f\",IF(Schueler30Punkte!$G24>1,\"f\",Schueler30Punkte!$G24)))","v":""},{"$error":"#DIV/0!"}]
[4,"MO22",null,null,null,1,{"$f":"IF(Schueler1Punkte!$D$1=0,\"\",IF(Schueler1Punkte!$G25=\"\",\"f\",IF(Schueler1Punkte!$G25>1,\"f\",Schueler1Punkte!$G25)))","v":""},{"$f":"IF(Schueler2Punkte!$D$1=0,\"\",IF(Schueler2Punkte!$G25=\"\",\"f\",IF(Schueler2Punkte!$G25>1,\"f\",Schueler2Punkte!$G25)))","v":""},{"$f":"IF(Schueler3Punkte!$D$1=0,\"\",IF(Schueler3Punkte!$G25=\"\",\"f\",IF(Schueler3Punkte!$G25>1,\"f\",Schueler3Punkte!$G25)))","v":""},{"$f":"IF(Schueler4Punkte!$D$1=0,\"\",IF(Schueler4Punkte!$G25=\"\",\"f\",IF(Schueler4Punkte!$G25>1,\"f\",Schueler4Punkte!$G25)))","v":""},{"$f":"IF(Schueler5Punkte!$D$1=0,\"\",IF(Schueler5Punkte!$G25=\"\",\"f\",IF(Schueler5Punkte!$G25>1,\"f\",Schueler5Punkte!$G25)))","v":""},{"$f":"IF(Schueler6Punkte!$D$1=0,\"\",IF(Schueler6Punkte!$G25=\"\",\"f\",IF(Schueler6Punkte!$G25>1,\"f\",Schueler6Punkte!$G25)))","v":""},{"$f":"IF(Schueler7Punkte!$D$1=0,\"\",IF(Schueler7Punkte!$G25=\"\",\"f\",IF(Schueler7Punkte!$G25>1,\"f\",Schueler7Punkte!$G25)))","v":""},{"$f":"IF(Schueler8Punkte!$D$1=0,\"\",IF(Schueler8Punkte!$G25=\"\",\"f\",IF(Schueler8Punkte!$G25>1,\"f\",Schueler8Punkte!$G25)))","v":""},{"$f":"IF(Schueler9Punkte!$D$1=0,\"\",IF(Schueler9Punkte!$G25=\"\",\"f\",IF(Schueler9Punkte!$G25>1,\"f\",Schueler9Punkte!$G25)))","v":""},{"$f":"IF(Schueler10Punkte!$D$1=0,\"\",IF(Schueler10Punkte!$G25=\"\",\"f\",IF(Schueler10Punkte!$G25>1,\"f\",Schueler10Punkte!$G25)))","v":""},{"$f":"IF(Schueler11Punkte!$D$1=0,\"\",IF(Schueler11Punkte!$G25=\"\",\"f\",IF(Schueler11Punkte!$G25>1,\"f\",Schueler11Punkte!$G25)))","v":""},{"$f":"IF(Schueler12Punkte!$D$1=0,\"\",IF(Schueler12Punkte!$G25=\"\",\"f\",IF(Schueler12Punkte!$G25>1,\"f\",Schueler12Punkte!$G25)))","v":""},{"$f":"IF(Schueler13Punkte!$D$1=0,\"\",IF(Schueler13Punkte!$G25=\"\",\"f\",IF(Schueler13Punkte!$G25>1,\"f\",Schueler13Punkte!$G25)))","v":""},{"$f":"IF(Schueler14Punkte!$D$1=0,\"\",IF(Schueler14Punkte!$G25=\"\",\"f\",IF(Schueler14Punkte!$G25>1,\"f\",Schueler14Punkte!$G25)))","v":""},{"$f":"IF(Schueler15Punkte!$D$1=0,\"\",IF(Schueler15Punkte!$G25=\"\",\"f\",IF(Schueler15Punkte!$G25>1,\"f\",Schueler15Punkte!$G25)))","v":""},{"$f":"IF(Schueler16Punkte!$D$1=0,\"\",IF(Schueler16Punkte!$G25=\"\",\"f\",IF(Schueler16Punkte!$G25>1,\"f\",Schueler16Punkte!$G25)))","v":""},{"$f":"IF(Schueler17Punkte!$D$1=0,\"\",IF(Schueler17Punkte!$G25=\"\",\"f\",IF(Schueler17Punkte!$G25>1,\"f\",Schueler17Punkte!$G25)))","v":""},{"$f":"IF(Schueler18Punkte!$D$1=0,\"\",IF(Schueler18Punkte!$G25=\"\",\"f\",IF(Schueler18Punkte!$G25>1,\"f\",Schueler18Punkte!$G25)))","v":""},{"$f":"IF(Schueler19Punkte!$D$1=0,\"\",IF(Schueler19Punkte!$G25=\"\",\"f\",IF(Schueler19Punkte!$G25>1,\"f\",Schueler19Punkte!$G25)))","v":""},{"$f":"IF(Schueler20Punkte!$D$1=0,\"\",IF(Schueler20Punkte!$G25=\"\",\"f\",IF(Schueler20Punkte!$G25>1,\"f\",Schueler20Punkte!$G25)))","v":""},{"$f":"IF(Schueler21Punkte!$D$1=0,\"\",IF(Schueler21Punkte!$G25=\"\",\"f\",IF(Schueler21Punkte!$G25>1,\"f\",Schueler21Punkte!$G25)))","v":""},{"$f":"IF(Schueler22Punkte!$D$1=0,\"\",IF(Schueler22Punkte!$G25=\"\",\"f\",IF(Schueler22Punkte!$G25>1,\"f\",Schueler22Punkte!$G25)))","v":""},{"$f":"IF(Schueler23Punkte!$D$1=0,\"\",IF(Schueler23Punkte!$G25=\"\",\"f\",IF(Schueler23Punkte!$G25>1,\"f\",Schueler23Punkte!$G25)))","v":""},{"$f":"IF(Schueler24Punkte!$D$1=0,\"\",IF(Schueler24Punkte!$G25=\"\",\"f\",IF(Schueler24Punkte!$G25>1,\"f\",Schueler24Punkte!$G25)))","v":""},{"$f":"IF(Schueler25Punkte!$D$1=0,\"\",IF(Schueler25Punkte!$G25=\"\",\"f\",IF(Schueler25Punkte!$G25>1,\"f\",Schueler25Punkte!$G25)))","v":""},{"$f":"IF(Schueler26Punkte!$D$1=0,\"\",IF(Schueler26Punkte!$G25=\"\",\"f\",IF(Schueler26Punkte!$G25>1,\"f\",Schueler26Punkte!$G25)))","v":""},{"$f":"IF(Schueler27Punkte!$D$1=0,\"\",IF(Schueler27Punkte!$G25=\"\",\"f\",IF(Schueler27Punkte!$G25>1,\"f\",Schueler27Punkte!$G25)))","v":""},{"$f":"IF(Schueler28Punkte!$D$1=0,\"\",IF(Schueler28Punkte!$G25=\"\",\"f\",IF(Schueler28Punkte!$G25>1,\"f\",Schueler28Punkte!$G25)))","v":""},{"$f":"IF(Schueler29Punkte!$D$1=0,\"\",IF(Schueler29Punkte!$G25=\"\",\"f\",IF(Schueler29Punkte!$G25>1,\"f\",Schueler29Punkte!$G25)))","v":""},{"$f":"IF(Schueler30Punkte!$D$1=0,\"\",IF(Schueler30Punkte!$G25=\"\",\"f\",IF(Schueler30Punkte!$G25>1,\"f\",Schueler30Punkte!$G25)))","v":""},{"$error":"#DIV/0!"}]
[null,null,"SYNTAX",null,null,4,{"$f":"IF(OR(G33=\"\",G33=\"f\"),\"\",SUM(G33,G34,G35,G36))","v":""},{"$f":"IF(OR(H33=\"\",H33=\"f\"),\"\",SUM(H33,H34,H35,H36))","v":""},"","","","","","","","","","","","","","","","","","","","","","","","","","","",""]
[1,"SY25",null,null,null,1,{"$f":"IF(Schueler1Punkte!$D$1=0,\"\",IF(Schueler1Punkte!$G26=\"\",\"f\",IF(Schueler1Punkte!$G26>1,\"f\",Schueler1Punkte!$G26)))","v":""},{"$f":"IF(Schueler2Punkte!$D$1=0,\"\",IF(Schueler2Punkte!$G26=\"\",\"f\",IF(Schueler2Punkte!$G26>1,\"f\",Schueler2Punkte!$G26)))","v":""},{"$f":"IF(Schueler3Punkte!$D$1=0,\"\",IF(Schueler3Punkte!$G26=\"\",\"f\",IF(Schueler3Punkte!$G26>1,\"f\",Schueler3Punkte!$G26)))","v":""},{"$f":"IF(Schueler4Punkte!$D$1=0,\"\",IF(Schueler4Punkte!$G26=\"\",\"f\",IF(Schueler4Punkte!$G26>1,\"f\",Schueler4Punkte!$G26)))","v":""},{"$f":"IF(Schueler5Punkte!$D$1=0,\"\",IF(Schueler5Punkte!$G26=\"\",\"f\",IF(Schueler5Punkte!$G26>1,\"f\",Schueler5Punkte!$G26)))","v":""},{"$f":"IF(Schueler6Punkte!$D$1=0,\"\",IF(Schueler6Punkte!$G26=\"\",\"f\",IF(Schueler6Punkte!$G26>1,\"f\",Schueler6Punkte!$G26)))","v":""},{"$f":"IF(Schueler7Punkte!$D$1=0,\"\",IF(Schueler7Punkte!$G26=\"\",\"f\",IF(Schueler7Punkte!$G26>1,\"f\",Schueler7Punkte!$G26)))","v":""},{"$f":"IF(Schueler8Punkte!$D$1=0,\"\",IF(Schueler8Punkte!$G26=\"\",\"f\",IF(Schueler8Punkte!$G26>1,\"f\",Schueler8Punkte!$G26)))","v":""},{"$f":"IF(Schueler9Punkte!$D$1=0,\"\",IF(Schueler9Punkte!$G26=\"\",\"f\",IF(Schueler9Punkte!$G26>1,\"f\",Schueler9Punkte!$G26)))","v":""},{"$f":"IF(Schueler10Punkte!$D$1=0,\"\",IF(Schueler10Punkte!$G26=\"\",\"f\",IF(Schueler10Punkte!$G26>1,\"f\",Schueler10Punkte!$G26)))","v":""},{"$f":"IF(Schueler11Punkte!$D$1=0,\"\",IF(Schueler11Punkte!$G26=\"\",\"f\",IF(Schueler11Punkte!$G26>1,\"f\",Schueler11Punkte!$G26)))","v":""},{"$f":"IF(Schueler12Punkte!$D$1=0,\"\",IF(Schueler12Punkte!$G26=\"\",\"f\",IF(Schueler12Punkte!$G26>1,\"f\",Schueler12Punkte!$G26)))","v":""},{"$f":"IF(Schueler13Punkte!$D$1=0,\"\",IF(Schueler13Punkte!$G26=\"\",\"f\",IF(Schueler13Punkte!$G26>1,\"f\",Schueler13Punkte!$G26)))","v":""},{"$f":"IF(Schueler14Punkte!$D$1=0,\"\",IF(Schueler14Punkte!$G26=\"\",\"f\",IF(Schueler14Punkte!$G26>1,\"f\",Schueler14Punkte!$G26)))","v":""},{"$f":"IF(Schueler15Punkte!$D$1=0,\"\",IF(Schueler15Punkte!$G26=\"\",\"f\",IF(Schueler15Punkte!$G26>1,\"f\",Schueler15Punkte!$G26)))","v":""},{"$f":"IF(Schueler16Punkte!$D$1=0,\"\",IF(Schueler16Punkte!$G26=\"\",\"f\",IF(Schueler16Punkte!$G26>1,\"f\",Schueler16Punkte!$G26)))","v":""},{"$f":"IF(Schueler17Punkte!$D$1=0,\"\",IF(Schueler17Punkte!$G26=\"\",\"f\",IF(Schueler17Punkte!$G26>1,\"f\",Schueler17Punkte!$G26)))","v":""},{"$f":"IF(Schueler18Punkte!$D$1=0,\"\",IF(Schueler18Punkte!$G26=\"\",\"f\",IF(Schueler18Punkte!$G26>1,\"f\",Schueler18Punkte!$G26)))","v":""},{"$f":"IF(Schueler19Punkte!$D$1=0,\"\",IF(Schueler19Punkte!$G26=\"\",\"f\",IF(Schueler19Punkte!$G26>1,\"f\",Schueler19Punkte!$G26)))","v":""},{"$f":"IF(Schueler20Punkte!$D$1=0,\"\",IF(Schueler20Punkte!$G26=\"\",\"f\",IF(Schueler20Punkte!$G26>1,\"f\",Schueler20Punkte!$G26)))","v":""},{"$f":"IF(Schueler21Punkte!$D$1=0,\"\",IF(Schueler21Punkte!$G26=\"\",\"f\",IF(Schueler21Punkte!$G26>1,\"f\",Schueler21Punkte!$G26)))","v":""},{"$f":"IF(Schueler22Punkte!$D$1=0,\"\",IF(Schueler22Punkte!$G26=\"\",\"f\",IF(Schueler22Punkte!$G26>1,\"f\",Schueler22Punkte!$G26)))","v":""},{"$f":"IF(Schueler23Punkte!$D$1=0,\"\",IF(Schueler23Punkte!$G26=\"\",\"f\",IF(Schueler23Punkte!$G26>1,\"f\",Schueler23Punkte!$G26)))","v":""},{"$f":"IF(Schueler24Punkte!$D$1=0,\"\",IF(Schueler24Punkte!$G26=\"\",\"f\",IF(Schueler24Punkte!$G26>1,\"f\",Schueler24Punkte!$G26)))","v":""},{"$f":"IF(Schueler25Punkte!$D$1=0,\"\",IF(Schueler25Punkte!$G26=\"\",\"f\",IF(Schueler25Punkte!$G26>1,\"f\",Schueler25Punkte!$G26)))","v":""},{"$f":"IF(Schueler26Punkte!$D$1=0,\"\",IF(Schueler26Punkte!$G26=\"\",\"f\",IF(Schueler26Punkte!$G26>1,\"f\",Schueler26Punkte!$G26)))","v":""},{"$f":"IF(Schueler27Punkte!$D$1=0,\"\",IF(Schueler27Punkte!$G26=\"\",\"f\",IF(Schueler27Punkte!$G26>1,\"f\",Schueler27Punkte!$G26)))","v":""},{"$f":"IF(Schueler28Punkte!$D$1=0,\"\",IF(Schueler28Punkte!$G26=\"\",\"f\",IF(Schueler28Punkte!$G26>1,\"f\",Schueler28Punkte!$G26)))","v":""},{"$f":"IF(Schueler29Punkte!$D$1=0,\"\",IF(Schueler29Punkte!$G26=\"\",\"f\",IF(Schueler29Punkte!$G26>1,\"f\",Schueler29Punkte!$G26)))","v":""},{"$f":"IF(Schueler30Punkte!$D$1=0,\"\",IF(Schueler30Punkte!$G26=\"\",\"f\",IF(Schueler30Punkte!$G26>1,\"f\",Schueler30Punkte!$G26)))","v":""},{"$error":"#DIV/0!"}]
[2,"SY26",null,null,null,1,{"$f":"IF(Schueler1Punkte!$D$1=0,\"\",IF(Schueler1Punkte!$G27=\"\",\"f\",IF(Schueler1Punkte!$G27>1,\"f\",Schueler1Punkte!$G27)))","v":""},{"$f":"IF(Schueler2Punkte!$D$1=0,\"\",IF(Schueler2Punkte!$G27=\"\",\"f\",IF(Schueler2Punkte!$G27>1,\"f\",Schueler2Punkte!$G27)))","v":""},{"$f":"IF(Schueler3Punkte!$D$1=0,\"\",IF(Schueler3Punkte!$G27=\"\",\"f\",IF(Schueler3Punkte!$G27>1,\"f\",Schueler3Punkte!$G27)))","v":""},{"$f":"IF(Schueler4Punkte!$D$1=0,\"\",IF(Schueler4Punkte!$G27=\"\",\"f\",IF(Schueler4Punkte!$G27>1,\"f\",Schueler4Punkte!$G27)))","v":""},{"$f":"IF(Schueler5Punkte!$D$1=0,\"\",IF(Schueler5Punkte!$G27=\"\",\"f\",IF(Schueler5Punkte!$G27>1,\"f\",Schueler5Punkte!$G27)))","v":""},{"$f":"IF(Schueler6Punkte!$D$1=0,\"\",IF(Schueler6Punkte!$G27=\"\",\"f\",IF(Schueler6Punkte!$G27>1,\"f\",Schueler6Punkte!$G27)))","v":""},{"$f":"IF(Schueler7Punkte!$D$1=0,\"\",IF(Schueler7Punkte!$G27=\"\",\"f\",IF(Schueler7Punkte!$G27>1,\"f\",Schueler7Punkte!$G27)))","v":""},{"$f":"IF(Schueler8Punkte!$D$1=0,\"\",IF(Schueler8Punkte!$G27=\"\",\"f\",IF(Schueler8Punkte!$G27>1,\"f\",Schueler8Punkte!$G27)))","v":""},{"$f":"IF(Schueler9Punkte!$D$1=0,\"\",IF(Schueler9Punkte!$G27=\"\",\"f\",IF(Schueler9Punkte!$G27>1,\"f\",Schueler9Punkte!$G27)))","v":""},{"$f":"IF(Schueler10Punkte!$D$1=0,\"\",IF(Schueler10Punkte!$G27=\"\",\"f\",IF(Schueler10Punkte!$G27>1,\"f\",Schueler10Punkte!$G27)))","v":""},{"$f":"IF(Schueler11Punkte!$D$1=0,\"\",IF(Schueler11Punkte!$G27=\"\",\"f\",IF(Schueler11Punkte!$G27>1,\"f\",Schueler11Punkte!$G27)))","v":""},{"$f":"IF(Schueler12Punkte!$D$1=0,\"\",IF(Schueler12Punkte!$G27=\"\",\"f\",IF(Schueler12Punkte!$G27>1,\"f\",Schueler12Punkte!$G27)))","v":""},{"$f":"IF(Schueler13Punkte!$D$1=0,\"\",IF(Schueler13Punkte!$G27=\"\",\"f\",IF(Schueler13Punkte!$G27>1,\"f\",Schueler13Punkte!$G27)))","v":""},{"$f":"IF(Schueler14Punkte!$D$1=0,\"\",IF(Schueler14Punkte!$G27=\"\",\"f\",IF(Schueler14Punkte!$G27>1,\"f\",Schueler14Punkte!$G27)))","v":""},{"$f":"IF(Schueler15Punkte!$D$1=0,\"\",IF(Schueler15Punkte!$G27=\"\",\"f\",IF(Schueler15Punkte!$G27>1,\"f\",Schueler15Punkte!$G27)))","v":""},{"$f":"IF(Schueler16Punkte!$D$1=0,\"\",IF(Schueler16Punkte!$G27=\"\",\"f\",IF(Schueler16Punkte!$G27>1,\"f\",Schueler16Punkte!$G27)))","v":""},{"$f":"IF(Schueler17Punkte!$D$1=0,\"\",IF(Schueler17Punkte!$G27=\"\",\"f\",IF(Schueler17Punkte!$G27>1,\"f\",Schueler17Punkte!$G27)))","v":""},{"$f":"IF(Schueler18Punkte!$D$1=0,\"\",IF(Schueler18Punkte!$G27=\"\",\"f\",IF(Schueler18Punkte!$G27>1,\"f\",Schueler18Punkte!$G27)))","v":""},{"$f":"IF(Schueler19Punkte!$D$1=0,\"\",IF(Schueler19Punkte!$G27=\"\",\"f\",IF(Schueler19Punkte!$G27>1,\"f\",Schueler19Punkte!$G27)))","v":""},{"$f":"IF(Schueler20Punkte!$D$1=0,\"\",IF(Schueler20Punkte!$G27=\"\",\"f\",IF(Schueler20Punkte!$G27>1,\"f\",Schueler20Punkte!$G27)))","v":""},{"$f":"IF(Schueler21Punkte!$D$1=0,\"\",IF(Schueler21Punkte!$G27=\"\",\"f\",IF(Schueler21Punkte!$G27>1,\"f\",Schueler21Punkte!$G27)))","v":""},{"$f":"IF(Schueler22Punkte!$D$1=0,\"\",IF(Schueler22Punkte!$G27=\"\",\"f\",IF(Schueler22Punkte!$G27>1,\"f\",Schueler22Punkte!$G27)))","v":""},{"$f":"IF(Schueler23Punkte!$D$1=0,\"\",IF(Schueler23Punkte!$G27=\"\",\"f\",IF(Schueler23Punkte!$G27>1,\"f\",Schueler23Punkte!$G27)))","v":""},{"$f":"IF(Schueler24Punkte!$D$1=0,\"\",IF(Schueler24Punkte!$G27=\"\",\"f\",IF(Schueler24Punkte!$G27>1,\"f\",Schueler24Punkte!$G27)))","v":""},{"$f":"IF(Schueler25Punkte!$D$1=0,\"\",IF(Schueler25Punkte!$G27=\"\",\"f\",IF(Schueler25Punkte!$G27>1,\"f\",Schueler25Punkte!$G27)))","v":""},{"$f":"IF(Schueler26Punkte!$D$1=0,\"\",IF(Schueler26Punkte!$G27=\"\",\"f\",IF(Schueler26Punkte!$G27>1,\"f\",Schueler26Punkte!$G27)))","v":""},{"$f":"IF(Schueler27Punkte!$D$1=0,\"\",IF(Schueler27Punkte!$G27=\"\",\"f\",IF(Schueler27Punkte!$G27>1,\"f\",Schueler27Punkte!$G27)))","v":""},{"$f":"IF(Schueler28Punkte!$D$1=0,\"\",IF(Schueler28Punkte!$G27=\"\",\"f\",IF(Schueler28Punkte!$G27>1,\"f\",Schueler28Punkte!$G27)))","v":""},{"$f":"IF(Schueler29Punkte!$D$1=0,\"\",IF(Schueler29Punkte!$G27=\"\",\"f\",IF(Schueler29Punkte!$G27>1,\"f\",Schueler29Punkte!$G27)))","v":""},{"$f":"IF(Schueler30Punkte!$D$1=0,\"\",IF(Schueler30Punkte!$G27=\"\",\"f\",IF(Schueler30Punkte!$G27>1,\"f\",Schueler30Punkte!$G27)))","v":""},{"$error":"#DIV/0!"}]
[3,"SY27",null,null,null,1,{"$f":"IF(Schueler1Punkte!$D$1=0,\"\",IF(Schueler1Punkte!$G28=\"\",\"f\",IF(Schueler1Punkte!$G28>1,\"f\",Schueler1Punkte!$G28)))","v":""},{"$f":"IF(Schueler2Punkte!$D$1=0,\"\",IF(Schueler2Punkte!$G28=\"\",\"f\",IF(Schueler2Punkte!$G28>1,\"f\",Schueler2Punkte!$G28)))","v":""},{"$f":"IF(Schueler3Punkte!$D$1=0,\"\",IF(Schueler3Punkte!$G28=\"\",\"f\",IF(Schueler3Punkte!$G28>1,\"f\",Schueler3Punkte!$G28)))","v":""},{"$f":"IF(Schueler4Punkte!$D$1=0,\"\",IF(Schueler4Punkte!$G28=\"\",\"f\",IF(Schueler4Punkte!$G28>1,\"f\",Schueler4Punkte!$G28)))","v":""},{"$f":"IF(Schueler5Punkte!$D$1=0,\"\",IF(Schueler5Punkte!$G28=\"\",\"f\",IF(Schueler5Punkte!$G28>1,\"f\",Schueler5Punkte!$G28)))","v":""},{"$f":"IF(Schueler6Punkte!$D$1=0,\"\",IF(Schueler6Punkte!$G28=\"\",\"f\",IF(Schueler6Punkte!$G28>1,\"f\",Schueler6Punkte!$G28)))","v":""},{"$f":"IF(Schueler7Punkte!$D$1=0,\"\",IF(Schueler7Punkte!$G28=\"\",\"f\",IF(Schueler7Punkte!$G28>1,\"f\",Schueler7Punkte!$G28)))","v":""},{"$f":"IF(Schueler8Punkte!$D$1=0,\"\",IF(Schueler8Punkte!$G28=\"\",\"f\",IF(Schueler8Punkte!$G28>1,\"f\",Schueler8Punkte!$G28)))","v":""},{"$f":"IF(Schueler9Punkte!$D$1=0,\"\",IF(Schueler9Punkte!$G28=\"\",\"f\",IF(Schueler9Punkte!$G28>1,\"f\",Schueler9Punkte!$G28)))","v":""},{"$f":"IF(Schueler10Punkte!$D$1=0,\"\",IF(Schueler10Punkte!$G28=\"\",\"f\",IF(Schueler10Punkte!$G28>1,\"f\",Schueler10Punkte!$G28)))","v":""},{"$f":"IF(Schueler11Punkte!$D$1=0,\"\",IF(Schueler11Punkte!$G28=\"\",\"f\",IF(Schueler11Punkte!$G28>1,\"f\",Schueler11Punkte!$G28)))","v":""},{"$f":"IF(Schueler12Punkte!$D$1=0,\"\",IF(Schueler12Punkte!$G28=\"\",\"f\",IF(Schueler12Punkte!$G28>1,\"f\",Schueler12Punkte!$G28)))","v":""},{"$f":"IF(Schueler13Punkte!$D$1=0,\"\",IF(Schueler13Punkte!$G28=\"\",\"f\",IF(Schueler13Punkte!$G28>1,\"f\",Schueler13Punkte!$G28)))","v":""},{"$f":"IF(Schueler14Punkte!$D$1=0,\"\",IF(Schueler14Punkte!$G28=\"\",\"f\",IF(Schueler14Punkte!$G28>1,\"f\",Schueler14Punkte!$G28)))","v":""},{"$f":"IF(Schueler15Punkte!$D$1=0,\"\",IF(Schueler15Punkte!$G28=\"\",\"f\",IF(Schueler15Punkte!$G28>1,\"f\",Schueler15Punkte!$G28)))","v":""},{"$f":"IF(Schueler16Punkte!$D$1=0,\"\",IF(Schueler16Punkte!$G28=\"\",\"f\",IF(Schueler16Punkte!$G28>1,\"f\",Schueler16Punkte!$G28)))","v":""},{"$f":"IF(Schueler17Punkte!$D$1=0,\"\",IF(Schueler17Punkte!$G28=\"\",\"f\",IF(Schueler17Punkte!$G28>1,\"f\",Schueler17Punkte!$G28)))","v":""},{"$f":"IF(Schueler18Punkte!$D$1=0,\"\",IF(Schueler18Punkte!$G28=\"\",\"f\",IF(Schueler18Punkte!$G28>1,\"f\",Schueler18Punkte!$G28)))","v":""},{"$f":"IF(Schueler19Punkte!$D$1=0,\"\",IF(Schueler19Punkte!$G28=\"\",\"f\",IF(Schueler19Punkte!$G28>1,\"f\",Schueler19Punkte!$G28)))","v":""},{"$f":"IF(Schueler20Punkte!$D$1=0,\"\",IF(Schueler20Punkte!$G28=\"\",\"f\",IF(Schueler20Punkte!$G28>1,\"f\",Schueler20Punkte!$G28)))","v":""},{"$f":"IF(Schueler21Punkte!$D$1=0,\"\",IF(Schueler21Punkte!$G28=\"\",\"f\",IF(Schueler21Punkte!$G28>1,\"f\",Schueler21Punkte!$G28)))","v":""},{"$f":"IF(Schueler22Punkte!$D$1=0,\"\",IF(Schueler22Punkte!$G28=\"\",\"f\",IF(Schueler22Punkte!$G28>1,\"f\",Schueler22Punkte!$G28)))","v":""},{"$f":"IF(Schueler23Punkte!$D$1=0,\"\",IF(Schueler23Punkte!$G28=\"\",\"f\",IF(Schueler23Punkte!$G28>1,\"f\",Schueler23Punkte!$G28)))","v":""},{"$f":"IF(Schueler24Punkte!$D$1=0,\"\",IF(Schueler24Punkte!$G28=\"\",\"f\",IF(Schueler24Punkte!$G28>1,\"f\",Schueler24Punkte!$G28)))","v":""},{"$f":"IF(Schueler25Punkte!$D$1=0,\"\",IF(Schueler25Punkte!$G28=\"\",\"f\",IF(Schueler25Punkte!$G28>1,\"f\",Schueler25Punkte!$G28)))","v":""},{"$f":"IF(Schueler26Punkte!$D$1=0,\"\",IF(Schueler26Punkte!$G28=\"\",\"f\",IF(Schueler26Punkte!$G28>1,\"f\",Schueler26Punkte!$G28)))","v":""},{"$f":"IF(Schueler27Punkte!$D$1=0,\"\",IF(Schueler27Punkte!$G28=\"\",\"f\",IF(Schueler27Punkte!$G28>1,\"f\",Schueler27Punkte!$G28)))","v":""},{"$f":"IF(Schueler28Punkte!$D$1=0,\"\",IF(Schueler28Punkte!$G28=\"\",\"f\",IF(Schueler28Punkte!$G28>1,\"f\",Schueler28Punkte!$G28)))","v":""},{"$f":"IF(Schueler29Punkte!$D$1=0,\"\",IF(Schueler29Punkte!$G28=\"\",\"f\",IF(Schueler29Punkte!$G28>1,\"f\",Schueler29Punkte!$G28)))","v":""},{"$f":"IF(Schueler30Punkte!$D$1=0,\"\",IF(Schueler30Punkte!$G28=\"\",\"f\",IF(Schueler30Punkte!$G28>1,\"f\",Schueler30Punkte!$G28)))","v":""},{"$error":"#DIV/0!"}]
[4,"SY28",null,null,null,1,{"$f":"IF(Schueler1Punkte!$D$1=0,\"\",IF(Schueler1Punkte!$G29=\"\",\"f\",IF(Schueler1Punkte!$G29>1,\"f\",Schueler1Punkte!$G29)))","v":""},{"$f":"IF(Schueler2Punkte!$D$1=0,\"\",IF(Schueler2Punkte!$G29=\"\",\"f\",IF(Schueler2Punkte!$G29>1,\"f\",Schueler2Punkte!$G29)))","v":""},{"$f":"IF(Schueler3Punkte!$D$1=0,\"\",IF(Schueler3Punkte!$G29=\"\",\"f\",IF(Schueler3Punkte!$G29>1,\"f\",Schueler3Punkte!$G29)))","v":""},{"$f":"IF(Schueler4Punkte!$D$1=0,\"\",IF(Schueler4Punkte!$G29=\"\",\"f\",IF(Schueler4Punkte!$G29>1,\"f\",Schueler4Punkte!$G29)))","v":""},{"$f":"IF(Schueler5Punkte!$D$1=0,\"\",IF(Schueler5Punkte!$G29=\"\",\"f\",IF(Schueler5Punkte!$G29>1,\"f\",Schueler5Punkte!$G29)))","v":""},{"$f":"IF(Schueler6Punkte!$D$1=0,\"\",IF(Schueler6Punkte!$G29=\"\",\"f\",IF(Schueler6Punkte!$G29>1,\"f\",Schueler6Punkte!$G29)))","v":""},{"$f":"IF(Schueler7Punkte!$D$1=0,\"\",IF(Schueler7Punkte!$G29=\"\",\"f\",IF(Schueler7Punkte!$G29>1,\"f\",Schueler7Punkte!$G29)))","v":""},{"$f":"IF(Schueler8Punkte!$D$1=0,\"\",IF(Schueler8Punkte!$G29=\"\",\"f\",IF(Schueler8Punkte!$G29>1,\"f\",Schueler8Punkte!$G29)))","v":""},{"$f":"IF(Schueler9Punkte!$D$1=0,\"\",IF(Schueler9Punkte!$G29=\"\",\"f\",IF(Schueler9Punkte!$G29>1,\"f\",Schueler9Punkte!$G29)))","v":""},{"$f":"IF(Schueler10Punkte!$D$1=0,\"\",IF(Schueler10Punkte!$G29=\"\",\"f\",IF(Schueler10Punkte!$G29>1,\"f\",Schueler10Punkte!$G29)))","v":""},{"$f":"IF(Schueler11Punkte!$D$1=0,\"\",IF(Schueler11Punkte!$G29=\"\",\"f\",IF(Schueler11Punkte!$G29>1,\"f\",Schueler11Punkte!$G29)))","v":""},{"$f":"IF(Schueler12Punkte!$D$1=0,\"\",IF(Schueler12Punkte!$G29=\"\",\"f\",IF(Schueler12Punkte!$G29>1,\"f\",Schueler12Punkte!$G29)))","v":""},{"$f":"IF(Schueler13Punkte!$D$1=0,\"\",IF(Schueler13Punkte!$G29=\"\",\"f\",IF(Schueler13Punkte!$G29>1,\"f\",Schueler13Punkte!$G29)))","v":""},{"$f":"IF(Schueler14Punkte!$D$1=0,\"\",IF(Schueler14Punkte!$G29=\"\",\"f\",IF(Schueler14Punkte!$G29>1,\"f\",Schueler14Punkte!$G29)))","v":""},{"$f":"IF(Schueler15Punkte!$D$1=0,\"\",IF(Schueler15Punkte!$G29=\"\",\"f\",IF(Schueler15Punkte!$G29>1,\"f\",Schueler15Punkte!$G29)))","v":""},{"$f":"IF(Schueler16Punkte!$D$1=0,\"\",IF(Schueler16Punkte!$G29=\"\",\"f\",IF(Schueler16Punkte!$G29>1,\"f\",Schueler16Punkte!$G29)))","v":""},{"$f":"IF(Schueler17Punkte!$D$1=0,\"\",IF(Schueler17Punkte!$G29=\"\",\"f\",IF(Schueler17Punkte!$G29>1,\"f\",Schueler17Punkte!$G29)))","v":""},{"$f":"IF(Schueler18Punkte!$D$1=0,\"\",IF(Schueler18Punkte!$G29=\"\",\"f\",IF(Schueler18Punkte!$G29>1,\"f\",Schueler18Punkte!$G29)))","v":""},{"$f":"IF(Schueler19Punkte!$D$1=0,\"\",IF(Schueler19Punkte!$G29=\"\",\"f\",IF(Schueler19Punkte!$G29>1,\"f\",Schueler19Punkte!$G29)))","v":""},{"$f":"IF(Schueler20Punkte!$D$1=0,\"\",IF(Schueler20Punkte!$G29=\"\",\"f\",IF(Schueler20Punkte!$G29>1,\"f\",Schueler20Punkte!$G29)))","v":""},{"$f":"IF(Schueler21Punkte!$D$1=0,\"\",IF(Schueler21Punkte!$G29=\"\",\"f\",IF(Schueler21Punkte!$G29>1,\"f\",Schueler21Punkte!$G29)))","v":""},{"$f":"IF(Schueler22Punkte!$D$1=0,\"\",IF(Schueler22Punkte!$G29=\"\",\"f\",IF(Schueler22Punkte!$G29>1,\"f\",Schueler22Punkte!$G29)))","v":""},{"$f":"IF(Schueler23Punkte!$D$1=0,\"\",IF(Schueler23Punkte!$G29=\"\",\"f\",IF(Schueler23Punkte!$G29>1,\"f\",Schueler23Punkte!$G29)))","v":""},{"$f":"IF(Schueler24Punkte!$D$1=0,\"\",IF(Schueler24Punkte!$G29=\"\",\"f\",IF(Schueler24Punkte!$G29>1,\"f\",Schueler24Punkte!$G29)))","v":""},{"$f":"IF(Schueler25Punkte!$D$1=0,\"\",IF(Schueler25Punkte!$G29=\"\",\"f\",IF(Schueler25Punkte!$G29>1,\"f\",Schueler25Punkte!$G29)))","v":""},{"$f":"IF(Schueler26Punkte!$D$1=0,\"\",IF(Schueler26Punkte!$G29=\"\",\"f\",IF(Schueler26Punkte!$G29>1,\"f\",Schueler26Punkte!$G29)))","v":""},{"$f":"IF(Schueler27Punkte!$D$1=0,\"\",IF(Schueler27Punkte!$G29=\"\",\"f\",IF(Schueler27Punkte!$G29>1,\"f\",Schueler27Punkte!$G29)))","v":""},{"$f":"IF(Schueler28Punkte!$D$1=0,\"\",IF(Schueler28Punkte!$G29=\"\",\"f\",IF(Schueler28Punkte!$G29>1,\"f\",Schueler28Punkte!$G29)))","v":""},{"$f":"IF(Schueler29Punkte!$D$1=0,\"\",IF(Schueler29Punkte!$G29=\"\",\"f\",IF(Schueler29Punkte!$G29>1,\"f\",Schueler29Punkte!$G29)))","v":""},{"$f":"IF(Schueler30Punkte!$D$1=0,\"\",IF(Schueler30Punkte!$G29=\"\",\"f\",IF(Schueler30Punkte!$G29>1,\"f\",Schueler30Punkte!$G29)))","v":""},{"$error":"#DIV/0!"}]
["2.",null,"SPRACHLICHE QUALITÄT IN DER ZIELSPRACHE",null,null,"4/2/0"]
[1,null,"gut verständlich/  mit einiger Anstrengung verständlich/ kaum verständlich",null,null,null,{"$f":"IF(Schueler1Punkte!$G$30=\"\",\"\",IF(Schueler1Punkte!$G$30=1,\"f\",IF(Schueler1Punkte!$G$30=3,\"f\",IF(Schueler1Punkte!$G$30=5,\"f\",IF(Schueler1Punkte!$G$30>5,\"f\",Schueler1Punkte!$G30)))))","v":""},{"$f":"IF(Schueler2Punkte!$G$30=\"\",\"\",IF(Schueler2Punkte!$G$30=1,\"f\",IF(Schueler2Punkte!$G$30=3,\"f\",IF(Schueler2Punkte!$G$30=5,\"f\",IF(Schueler2Punkte!$G$30>5,\"f\",Schueler2Punkte!$G30)))))","v":""},{"$f":"IF(Schueler3Punkte!$G$30=\"\",\"\",IF(Schueler3Punkte!$G$30=1,\"f\",IF(Schueler3Punkte!$G$30=3,\"f\",IF(Schueler3Punkte!$G$30=5,\"f\",IF(Schueler3Punkte!$G$30>5,\"f\",Schueler3Punkte!$G30)))))","v":""},{"$f":"IF(Schueler4Punkte!$G$30=\"\",\"\",IF(Schueler4Punkte!$G$30=1,\"f\",IF(Schueler4Punkte!$G$30=3,\"f\",IF(Schueler4Punkte!$G$30=5,\"f\",IF(Schueler4Punkte!$G$30>5,\"f\",Schueler4Punkte!$G30)))))","v":""},{"$f":"IF(Schueler5Punkte!$G$30=\"\",\"\",IF(Schueler5Punkte!$G$30=1,\"f\",IF(Schueler5Punkte!$G$30=3,\"f\",IF(Schueler5Punkte!$G$30=5,\"f\",IF(Schueler5Punkte!$G$30>5,\"f\",Schueler5Punkte!$G30)))))","v":""},{"$f":"IF(Schueler6Punkte!$G$30=\"\",\"\",IF(Schueler6Punkte!$G$30=1,\"f\",IF(Schueler6Punkte!$G$30=3,\"f\",IF(Schueler6Punkte!$G$30=5,\"f\",IF(Schueler6Punkte!$G$30>5,\"f\",Schueler6Punkte!$G30)))))","v":""},{"$f":"IF(Schueler7Punkte!$G$30=\"\",\"\",IF(Schueler7Punkte!$G$30=1,\"f\",IF(Schueler7Punkte!$G$30=3,\"f\",IF(Schueler7Punkte!$G$30=5,\"f\",IF(Schueler7Punkte!$G$30>5,\"f\",Schueler7Punkte!$G30)))))","v":""},{"$f":"IF(Schueler8Punkte!$G$30=\"\",\"\",IF(Schueler8Punkte!$G$30=1,\"f\",IF(Schueler8Punkte!$G$30=3,\"f\",IF(Schueler8Punkte!$G$30=5,\"f\",IF(Schueler8Punkte!$G$30>5,\"f\",Schueler8Punkte!$G30)))))","v":""},{"$f":"IF(Schueler9Punkte!$G$30=\"\",\"\",IF(Schueler9Punkte!$G$30=1,\"f\",IF(Schueler9Punkte!$G$30=3,\"f\",IF(Schueler9Punkte!$G$30=5,\"f\",IF(Schueler9Punkte!$G$30>5,\"f\",Schueler9Punkte!$G30)))))","v":""},{"$f":"IF(Schueler10Punkte!$G$30=\"\",\"\",IF(Schueler10Punkte!$G$30=1,\"f\",IF(Schueler10Punkte!$G$30=3,\"f\",IF(Schueler10Punkte!$G$30=5,\"f\",IF(Schueler10Punkte!$G$30>5,\"f\",Schueler10Punkte!$G30)))))","v":""},{"$f":"IF(Schueler11Punkte!$G$30=\"\",\"\",IF(Schueler11Punkte!$G$30=1,\"f\",IF(Schueler11Punkte!$G$30=3,\"f\",IF(Schueler11Punkte!$G$30=5,\"f\",IF(Schueler11Punkte!$G$30>5,\"f\",Schueler11Punkte!$G30)))))","v":""},{"$f":"IF(Schueler12Punkte!$G$30=\"\",\"\",IF(Schueler12Punkte!$G$30=1,\"f\",IF(Schueler12Punkte!$G$30=3,\"f\",IF(Schueler12Punkte!$G$30=5,\"f\",IF(Schueler12Punkte!$G$30>5,\"f\",Schueler12Punkte!$G30)))))","v":""},{"$f":"IF(Schueler13Punkte!$G$30=\"\",\"\",IF(Schueler13Punkte!$G$30=1,\"f\",IF(Schueler13Punkte!$G$30=3,\"f\",IF(Schueler13Punkte!$G$30=5,\"f\",IF(Schueler13Punkte!$G$30>5,\"f\",Schueler13Punkte!$G30)))))","v":""},{"$f":"IF(Schueler14Punkte!$G$30=\"\",\"\",IF(Schueler14Punkte!$G$30=1,\"f\",IF(Schueler14Punkte!$G$30=3,\"f\",IF(Schueler14Punkte!$G$30=5,\"f\",IF(Schueler14Punkte!$G$30>5,\"f\",Schueler14Punkte!$G30)))))","v":""},{"$f":"IF(Schueler15Punkte!$G$30=\"\",\"\",IF(Schueler15Punkte!$G$30=1,\"f\",IF(Schueler15Punkte!$G$30=3,\"f\",IF(Schueler15Punkte!$G$30=5,\"f\",IF(Schueler15Punkte!$G$30>5,\"f\",Schueler15Punkte!$G30)))))","v":""},{"$f":"IF(Schueler16Punkte!$G$30=\"\",\"\",IF(Schueler16Punkte!$G$30=1,\"f\",IF(Schueler16Punkte!$G$30=3,\"f\",IF(Schueler16Punkte!$G$30=5,\"f\",IF(Schueler16Punkte!$G$30>5,\"f\",Schueler16Punkte!$G30)))))","v":""},{"$f":"IF(Schueler17Punkte!$G$30=\"\",\"\",IF(Schueler17Punkte!$G$30=1,\"f\",IF(Schueler17Punkte!$G$30=3,\"f\",IF(Schueler17Punkte!$G$30=5,\"f\",IF(Schueler17Punkte!$G$30>5,\"f\",Schueler17Punkte!$G30)))))","v":""},{"$f":"IF(Schueler18Punkte!$G$30=\"\",\"\",IF(Schueler18Punkte!$G$30=1,\"f\",IF(Schueler18Punkte!$G$30=3,\"f\",IF(Schueler18Punkte!$G$30=5,\"f\",IF(Schueler18Punkte!$G$30>5,\"f\",Schueler18Punkte!$G30)))))","v":""},{"$f":"IF(Schueler19Punkte!$G$30=\"\",\"\",IF(Schueler19Punkte!$G$30=1,\"f\",IF(Schueler19Punkte!$G$30=3,\"f\",IF(Schueler19Punkte!$G$30=5,\"f\",IF(Schueler19Punkte!$G$30>5,\"f\",Schueler19Punkte!$G30)))))","v":""},{"$f":"IF(Schueler20Punkte!$G$30=\"\",\"\",IF(Schueler20Punkte!$G$30=1,\"f\",IF(Schueler20Punkte!$G$30=3,\"f\",IF(Schueler20Punkte!$G$30=5,\"f\",IF(Schueler20Punkte!$G$30>5,\"f\",Schueler20Punkte!$G30)))))","v":""},{"$f":"IF(Schueler21Punkte!$G$30=\"\",\"\",IF(Schueler21Punkte!$G$30=1,\"f\",IF(Schueler21Punkte!$G$30=3,\"f\",IF(Schueler21Punkte!$G$30=5,\"f\",IF(Schueler21Punkte!$G$30>5,\"f\",Schueler21Punkte!$G30)))))","v":""},{"$f":"IF(Schueler22Punkte!$G$30=\"\",\"\",IF(Schueler22Punkte!$G$30=1,\"f\",IF(Schueler22Punkte!$G$30=3,\"f\",IF(Schueler22Punkte!$G$30=5,\"f\",IF(Schueler22Punkte!$G$30>5,\"f\",Schueler22Punkte!$G30)))))","v":""},{"$f":"IF(Schueler23Punkte!$G$30=\"\",\"\",IF(Schueler23Punkte!$G$30=1,\"f\",IF(Schueler23Punkte!$G$30=3,\"f\",IF(Schueler23Punkte!$G$30=5,\"f\",IF(Schueler23Punkte!$G$30>5,\"f\",Schueler23Punkte!$G30)))))","v":""},{"$f":"IF(Schueler24Punkte!$G$30=\"\",\"\",IF(Schueler24Punkte!$G$30=1,\"f\",IF(Schueler24Punkte!$G$30=3,\"f\",IF(Schueler24Punkte!$G$30=5,\"f\",IF(Schueler24Punkte!$G$30>5,\"f\",Schueler24Punkte!$G30)))))","v":""},{"$f":"IF(Schueler25Punkte!$G$30=\"\",\"\",IF(Schueler25Punkte!$G$30=1,\"f\",IF(Schueler25Punkte!$G$30=3,\"f\",IF(Schueler25Punkte!$G$30=5,\"f\",IF(Schueler25Punkte!$G$30>5,\"f\",Schueler25Punkte!$G30)))))","v":""},{"$f":"IF(Schueler26Punkte!$G$30=\"\",\"\",IF(Schueler26Punkte!$G$30=1,\"f\",IF(Schueler26Punkte!$G$30=3,\"f\",IF(Schueler26Punkte!$G$30=5,\"f\",IF(Schueler26Punkte!$G$30>5,\"f\",Schueler26Punkte!$G30)))))","v":""},{"$f":"IF(Schueler27Punkte!$G$30=\"\",\"\",IF(Schueler27Punkte!$G$30=1,\"f\",IF(Schueler27Punkte!$G$30=3,\"f\",IF(Schueler27Punkte!$G$30=5,\"f\",IF(Schueler27Punkte!$G$30>5,\"f\",Schueler27Punkte!$G30)))))","v":""},{"$f":"IF(Schueler28Punkte!$G$30=\"\",\"\",IF(Schueler28Punkte!$G$30=1,\"f\",IF(Schueler28Punkte!$G$30=3,\"f\",IF(Schueler28Punkte!$G$30=5,\"f\",IF(Schueler28Punkte!$G$30>5,\"f\",Schueler28Punkte!$G30)))))","v":""},{"$f":"IF(Schueler29Punkte!$G$30=\"\",\"\",IF(Schueler29Punkte!$G$30=1,\"f\",IF(Schueler29Punkte!$G$30=3,\"f\",IF(Schueler29Punkte!$G$30=5,\"f\",IF(Schueler29Punkte!$G$30>5,\"f\",Schueler29Punkte!$G30)))))","v":""},{"$f":"IF(Schueler30Punkte!$G$30=\"\",\"\",IF(Schueler30Punkte!$G$30=1,\"f\",IF(Schueler30Punkte!$G$30=3,\"f\",IF(Schueler30Punkte!$G$30=5,\"f\",IF(Schueler30Punkte!$G$30>5,\"f\",Schueler30Punkte!$G30)))))","v":""},{"$f":"SUM(G38:AJ38)/((COUNTIF(G38:AJ38,0)+COUNTIF(G38:AJ38,3)+COUNTIF(G38:AJ38,6))*6)","v":{"$error":"#DIV/0!"}}]
[null,"Summe",null,null,null,24,{"$f":"IF(G1=\"\",\"\",COUNTIF(G6:G21,\"1\")+COUNTIF(G23:G26,\"1\")+COUNTIF(G28:G31,\"1\")+COUNTIF(G33:G36,\"1\")+IF(Schueler1Punkte!$G30=\"\",0,Schueler1Punkte!$G30))","v":""},{"$f":"IF(H1=\"\",\"\",COUNTIF(H6:H21,\"1\")+COUNTIF(H23:H26,\"1\")+COUNTIF(H28:H31,\"1\")+COUNTIF(H33:H36,\"1\")+IF(Schueler2Punkte!G30=\"\",0,Schueler2Punkte!G30))","v":""},{"$f":"IF(I1=\"\",\"\",COUNTIF(I6:I21,\"1\")+COUNTIF(I23:I26,\"1\")+COUNTIF(I28:I31,\"1\")+COUNTIF(I33:I36,\"1\")+IF(Schueler3Punkte!G30=\"\",0,Schueler3Punkte!G30))","v":""},{"$f":"IF(J1=\"\",\"\",COUNTIF(J6:J21,\"1\")+COUNTIF(J23:J26,\"1\")+COUNTIF(J28:J31,\"1\")+COUNTIF(J33:J36,\"1\")+IF(Schueler4Punkte!G30=\"\",0,Schueler4Punkte!G30))","v":""},{"$f":"IF(K1=\"\",\"\",COUNTIF(K6:K21,\"1\")+COUNTIF(K23:K26,\"1\")+COUNTIF(K28:K31,\"1\")+COUNTIF(K33:K36,\"1\")+IF(Schueler5Punkte!G30=\"\",0,Schueler5Punkte!G30))","v":""},{"$f":"IF(L1=\"\",\"\",COUNTIF(L6:L21,\"1\")+COUNTIF(L23:L26,\"1\")+COUNTIF(L28:L31,\"1\")+COUNTIF(L33:L36,\"1\")+IF(Schueler6Punkte!G30=\"\",0,Schueler6Punkte!G30))","v":""},{"$f":"IF(M1=\"\",\"\",COUNTIF(M6:M21,\"1\")+COUNTIF(M23:M26,\"1\")+COUNTIF(M28:M31,\"1\")+COUNTIF(M33:M36,\"1\")+IF(Schueler7Punkte!G30=\"\",0,Schueler7Punkte!G30))","v":""},{"$f":"IF(N1=\"\",\"\",COUNTIF(N6:N21,\"1\")+COUNTIF(N23:N26,\"1\")+COUNTIF(N28:N31,\"1\")+COUNTIF(N33:N36,\"1\")+IF(Schueler8Punkte!G30=\"\",0,Schueler8Punkte!G30))","v":""},{"$f":"IF(O1=\"\",\"\",COUNTIF(O6:O21,\"1\")+COUNTIF(O23:O26,\"1\")+COUNTIF(O28:O31,\"1\")+COUNTIF(O33:O36,\"1\")+IF(Schueler9Punkte!G30=\"\",0,Schueler9Punkte!G30))","v":""},{"$f":"IF(P1=\"\",\"\",COUNTIF(P6:P21,\"1\")+COUNTIF(P23:P26,\"1\")+COUNTIF(P28:P31,\"1\")+COUNTIF(P33:P36,\"1\")+IF(Schueler10Punkte!G30=\"\",0,Schueler10Punkte!G30))","v":""},{"$f":"IF(Q1=\"\",\"\",COUNTIF(Q6:Q21,\"1\")+COUNTIF(Q23:Q26,\"1\")+COUNTIF(Q28:Q31,\"1\")+COUNTIF(Q33:Q36,\"1\")+IF(Schueler11Punkte!G30=\"\",0,Schueler11Punkte!G30))","v":""},{"$f":"IF(R1=\"\",\"\",COUNTIF(R6:R21,\"1\")+COUNTIF(R23:R26,\"1\")+COUNTIF(R28:R31,\"1\")+COUNTIF(R33:R36,\"1\")+IF(Schueler12Punkte!G30=\"\",0,Schueler12Punkte!G30))","v":""},{"$f":"IF(S1=\"\",\"\",COUNTIF(S6:S21,\"1\")+COUNTIF(S23:S26,\"1\")+COUNTIF(S28:S31,\"1\")+COUNTIF(S33:S36,\"1\")+IF(Schueler13Punkte!G30=\"\",0,Schueler13Punkte!G30))","v":""},{"$f":"IF(T1=\"\",\"\",COUNTIF(T6:T21,\"1\")+COUNTIF(T23:T26,\"1\")+COUNTIF(T28:T31,\"1\")+COUNTIF(T33:T36,\"1\")+IF(Schueler14Punkte!G30=\"\",0,Schueler14Punkte!G30))","v":""},{"$f":"IF(U1=\"\",\"\",COUNTIF(U6:U21,\"1\")+COUNTIF(U23:U26,\"1\")+COUNTIF(U28:U31,\"1\")+COUNTIF(U33:U36,\"1\")+IF(Schueler15Punkte!G30=\"\",0,Schueler15Punkte!G30))","v":""},{"$f":"IF(V1=\"\",\"\",COUNTIF(V6:V21,\"1\")+COUNTIF(V23:V26,\"1\")+COUNTIF(V28:V31,\"1\")+COUNTIF(V33:V36,\"1\")+IF(Schueler16Punkte!G30=\"\",0,Schueler16Punkte!G30))","v":""},{"$f":"IF(W1=\"\",\"\",COUNTIF(W6:W21,\"1\")+COUNTIF(W23:W26,\"1\")+COUNTIF(W28:W31,\"1\")+COUNTIF(W33:W36,\"1\")+IF(Schueler17Punkte!G30=\"\",0,Schueler17Punkte!G30))","v":""},{"$f":"IF(X1=\"\",\"\",COUNTIF(X6:X21,\"1\")+COUNTIF(X23:X26,\"1\")+COUNTIF(X28:X31,\"1\")+COUNTIF(X33:X36,\"1\")+IF(Schueler18Punkte!G30=\"\",0,Schueler18Punkte!G30))","v":""},{"$f":"IF(Y1=\"\",\"\",COUNTIF(Y6:Y21,\"1\")+COUNTIF(Y23:Y26,\"1\")+COUNTIF(Y28:Y31,\"1\")+COUNTIF(Y33:Y36,\"1\")+IF(Schueler19Punkte!G30=\"\",0,Schueler19Punkte!G30))","v":""},{"$f":"IF(Z1=\"\",\"\",COUNTIF(Z6:Z21,\"1\")+COUNTIF(Z23:Z26,\"1\")+COUNTIF(Z28:Z31,\"1\")+COUNTIF(Z33:Z36,\"1\")+IF(Schueler20Punkte!G30=\"\",0,Schueler20Punkte!G30))","v":""},{"$f":"IF(AA1=\"\",\"\",COUNTIF(AA6:AA21,\"1\")+COUNTIF(AA23:AA26,\"1\")+COUNTIF(AA28:AA31,\"1\")+COUNTIF(AA33:AA36,\"1\")+IF(Schueler21Punkte!G30=\"\",0,Schueler21Punkte!G30))","v":""},{"$f":"IF(AB1=\"\",\"\",COUNTIF(AB6:AB21,\"1\")+COUNTIF(AB23:AB26,\"1\")+COUNTIF(AB28:AB31,\"1\")+COUNTIF(AB33:AB36,\"1\")+IF(Schueler22Punkte!G30=\"\",0,Schueler22Punkte!G30))","v":""},{"$f":"IF(AC1=\"\",\"\",COUNTIF(AC6:AC21,\"1\")+COUNTIF(AC23:AC26,\"1\")+COUNTIF(AC28:AC31,\"1\")+COUNTIF(AC33:AC36,\"1\")+IF(Schueler23Punkte!G30=\"\",0,Schueler23Punkte!G30))","v":""},{"$f":"IF(AD1=\"\",\"\",COUNTIF(AD6:AD21,\"1\")+COUNTIF(AD23:AD26,\"1\")+COUNTIF(AD28:AD31,\"1\")+COUNTIF(AD33:AD36,\"1\")+IF(Schueler24Punkte!G30=\"\",0,Schueler24Punkte!G30))","v":""},{"$f":"IF(AE1=\"\",\"\",COUNTIF(AE6:AE21,\"1\")+COUNTIF(AE23:AE26,\"1\")+COUNTIF(AE28:AE31,\"1\")+COUNTIF(AE33:AE36,\"1\")+IF(Schueler25Punkte!G30=\"\",0,Schueler25Punkte!G30))","v":""},{"$f":"IF(AF1=\"\",\"\",COUNTIF(AF6:AF21,\"1\")+COUNTIF(AF23:AF26,\"1\")+COUNTIF(AF28:AF31,\"1\")+COUNTIF(AF33:AF36,\"1\")+IF(Schueler26Punkte!G30=\"\",0,Schueler26Punkte!G30))","v":""},{"$f":"IF(AG1=\"\",\"\",COUNTIF(AG6:AG21,\"1\")+COUNTIF(AG23:AG26,\"1\")+COUNTIF(AG28:AG31,\"1\")+COUNTIF(AG33:AG36,\"1\")+IF(Schueler27Punkte!G30=\"\",0,Schueler27Punkte!G30))","v":""},{"$f":"IF(AH1=\"\",\"\",COUNTIF(AH6:AH21,\"1\")+COUNTIF(AH23:AH26,\"1\")+COUNTIF(AH28:AH31,\"1\")+COUNTIF(AH33:AH36,\"1\")+IF(Schueler28Punkte!G30=\"\",0,Schueler28Punkte!G30))","v":""},{"$f":"IF(AI1=\"\",\"\",COUNTIF(AI6:AI21,\"1\")+COUNTIF(AI23:AI26,\"1\")+COUNTIF(AI28:AI31,\"1\")+COUNTIF(AI33:AI36,\"1\")+IF(Schueler29Punkte!G30=\"\",0,Schueler29Punkte!G30))","v":""},{"$f":"IF(AJ1=\"\",\"\",COUNTIF(AJ6:AJ21,\"1\")+COUNTIF(AJ23:AJ26,\"1\")+COUNTIF(AJ28:AJ31,\"1\")+COUNTIF(AJ33:AJ36,\"1\")+IF(Schueler30Punkte!G30=\"\",0,Schueler30Punkte!G30))","v":""}]
["Arbeitsaufgaben/Interpretation",null,null,{"$f":"IF(SUM(F41:F46)=0,\"\",IF(SUM(F41:F46)>F40,\"Fehler - zuviele Punkte\",SUM(F41:F46)))","v":16},{"$f":"IF(SUM(F41:F46)=0,\"\",IF(SUM(F41:F46)<F40,\"Fehler - zuwenig Punkte\",SUM(F41:F46)))","v":16},16,{"$f":"IF(G41=\"\",\"\",IF(COUNTIF($F41:$F46,\"\")<(COUNTIF(G41:G46,\"\")),\"\",SUM(IF(G46=\"\",0,G46),IF(G45=\"\",0,G45),IF(G44=\"\",0,G44),IF(G43=\"\",0,G43),IF(G42=\"\",0,G42),IF(G41=\"\",0,G41))))","v":""},{"$f":"IF(H41=\"\",\"\",IF(COUNTIF($F41:$F46,\"\")<(COUNTIF(H41:H46,\"\")),\"\",SUM(IF(H46=\"\",0,H46),IF(H45=\"\",0,H45),IF(H44=\"\",0,H44),IF(H43=\"\",0,H43),IF(H42=\"\",0,H42),IF(H41=\"\",0,H41))))","v":""},"","","","","","","","","","","","","","","","","","","","","","","","","","","",""]
[1,"IT1",null,null,null,4,{"$f":"IF(Schueler1Punkte!$D$1=0,\"\",IF(Schueler1Punkte!$M2=\"F\",\"f\",IF($F41=\"\",\"\",IF(AND(F41>0,Schueler1Punkte!$N2=\"\"),\"F\",IF(Schueler1Punkte!$N2=\"\",\"\",Schueler1Punkte!$N2)))))","v":""},{"$f":"IF(Schueler2Punkte!$D$1=0,\"\",IF(Schueler2Punkte!$M2=\"F\",\"f\",IF($F41=\"\",\"\",IF(AND(G41>0,Schueler2Punkte!$N2=\"\"),\"F\",IF(Schueler2Punkte!$N2=\"\",\"\",Schueler2Punkte!$N2)))))","v":""},{"$f":"IF(Schueler3Punkte!$D$1=0,\"\",IF(Schueler3Punkte!$M2=\"F\",\"f\",IF($F41=\"\",\"\",IF(AND(H41>0,Schueler3Punkte!$N2=\"\"),\"F\",IF(Schueler3Punkte!$N2=\"\",\"\",Schueler3Punkte!$N2)))))","v":""},{"$f":"IF(Schueler4Punkte!$D$1=0,\"\",IF(Schueler4Punkte!$M2=\"F\",\"f\",IF($F41=\"\",\"\",IF(AND(I41>0,Schueler4Punkte!$N2=\"\"),\"F\",IF(Schueler4Punkte!$N2=\"\",\"\",Schueler4Punkte!$N2)))))","v":""},{"$f":"IF(Schueler5Punkte!$D$1=0,\"\",IF(Schueler5Punkte!$M2=\"F\",\"f\",IF($F41=\"\",\"\",IF(AND(J41>0,Schueler5Punkte!$N2=\"\"),\"F\",IF(Schueler5Punkte!$N2=\"\",\"\",Schueler5Punkte!$N2)))))","v":""},{"$f":"IF(Schueler6Punkte!$D$1=0,\"\",IF(Schueler6Punkte!$M2=\"F\",\"f\",IF($F41=\"\",\"\",IF(AND(K41>0,Schueler6Punkte!$N2=\"\"),\"F\",IF(Schueler6Punkte!$N2=\"\",\"\",Schueler6Punkte!$N2)))))","v":""},{"$f":"IF(Schueler7Punkte!$D$1=0,\"\",IF(Schueler7Punkte!$M2=\"F\",\"f\",IF($F41=\"\",\"\",IF(AND(L41>0,Schueler7Punkte!$N2=\"\"),\"F\",IF(Schueler7Punkte!$N2=\"\",\"\",Schueler7Punkte!$N2)))))","v":""},{"$f":"IF(Schueler8Punkte!$D$1=0,\"\",IF(Schueler8Punkte!$M2=\"F\",\"f\",IF($F41=\"\",\"\",IF(AND(M41>0,Schueler8Punkte!$N2=\"\"),\"F\",IF(Schueler8Punkte!$N2=\"\",\"\",Schueler8Punkte!$N2)))))","v":""},{"$f":"IF(Schueler9Punkte!$D$1=0,\"\",IF(Schueler9Punkte!$M2=\"F\",\"f\",IF($F41=\"\",\"\",IF(AND(N41>0,Schueler9Punkte!$N2=\"\"),\"F\",IF(Schueler9Punkte!$N2=\"\",\"\",Schueler9Punkte!$N2)))))","v":""},{"$f":"IF(Schueler10Punkte!$D$1=0,\"\",IF(Schueler10Punkte!$M2=\"F\",\"f\",IF($F41=\"\",\"\",IF(AND(O41>0,Schueler10Punkte!$N2=\"\"),\"F\",IF(Schueler10Punkte!$N2=\"\",\"\",Schueler10Punkte!$N2)))))","v":""},{"$f":"IF(Schueler11Punkte!$D$1=0,\"\",IF(Schueler11Punkte!$M2=\"F\",\"f\",IF($F41=\"\",\"\",IF(AND(P41>0,Schueler11Punkte!$N2=\"\"),\"F\",IF(Schueler11Punkte!$N2=\"\",\"\",Schueler11Punkte!$N2)))))","v":""},{"$f":"IF(Schueler12Punkte!$D$1=0,\"\",IF(Schueler12Punkte!$M2=\"F\",\"f\",IF($F41=\"\",\"\",IF(AND(Q41>0,Schueler12Punkte!$N2=\"\"),\"F\",IF(Schueler12Punkte!$N2=\"\",\"\",Schueler12Punkte!$N2)))))","v":""},{"$f":"IF(Schueler13Punkte!$D$1=0,\"\",IF(Schueler13Punkte!$M2=\"F\",\"f\",IF($F41=\"\",\"\",IF(AND(R41>0,Schueler13Punkte!$N2=\"\"),\"F\",IF(Schueler13Punkte!$N2=\"\",\"\",Schueler13Punkte!$N2)))))","v":""},{"$f":"IF(Schueler14Punkte!$D$1=0,\"\",IF(Schueler14Punkte!$M2=\"F\",\"f\",IF($F41=\"\",\"\",IF(AND(S41>0,Schueler14Punkte!$N2=\"\"),\"F\",IF(Schueler14Punkte!$N2=\"\",\"\",Schueler14Punkte!$N2)))))","v":""},{"$f":"IF(Schueler15Punkte!$D$1=0,\"\",IF(Schueler15Punkte!$M2=\"F\",\"f\",IF($F41=\"\",\"\",IF(AND(T41>0,Schueler15Punkte!$N2=\"\"),\"F\",IF(Schueler15Punkte!$N2=\"\",\"\",Schueler15Punkte!$N2)))))","v":""},{"$f":"IF(Schueler16Punkte!$D$1=0,\"\",IF(Schueler16Punkte!$M2=\"F\",\"f\",IF($F41=\"\",\"\",IF(AND(U41>0,Schueler16Punkte!$N2=\"\"),\"F\",IF(Schueler16Punkte!$N2=\"\",\"\",Schueler16Punkte!$N2)))))","v":""},{"$f":"IF(Schueler17Punkte!$D$1=0,\"\",IF(Schueler17Punkte!$M2=\"F\",\"f\",IF($F41=\"\",\"\",IF(AND(V41>0,Schueler17Punkte!$N2=\"\"),\"F\",IF(Schueler17Punkte!$N2=\"\",\"\",Schueler17Punkte!$N2)))))","v":""},{"$f":"IF(Schueler18Punkte!$D$1=0,\"\",IF(Schueler18Punkte!$M2=\"F\",\"f\",IF($F41=\"\",\"\",IF(AND(W41>0,Schueler18Punkte!$N2=\"\"),\"F\",IF(Schueler18Punkte!$N2=\"\",\"\",Schueler18Punkte!$N2)))))","v":""},{"$f":"IF(Schueler19Punkte!$D$1=0,\"\",IF(Schueler19Punkte!$M2=\"F\",\"f\",IF($F41=\"\",\"\",IF(AND(X41>0,Schueler19Punkte!$N2=\"\"),\"F\",IF(Schueler19Punkte!$N2=\"\",\"\",Schueler19Punkte!$N2)))))","v":""},{"$f":"IF(Schueler20Punkte!$D$1=0,\"\",IF(Schueler20Punkte!$M2=\"F\",\"f\",IF($F41=\"\",\"\",IF(AND(Y41>0,Schueler20Punkte!$N2=\"\"),\"F\",IF(Schueler20Punkte!$N2=\"\",\"\",Schueler20Punkte!$N2)))))","v":""},{"$f":"IF(Schueler21Punkte!$D$1=0,\"\",IF(Schueler21Punkte!$M2=\"F\",\"f\",IF($F41=\"\",\"\",IF(AND(Z41>0,Schueler21Punkte!$N2=\"\"),\"F\",IF(Schueler21Punkte!$N2=\"\",\"\",Schueler21Punkte!$N2)))))","v":""},{"$f":"IF(Schueler22Punkte!$D$1=0,\"\",IF(Schueler22Punkte!$M2=\"F\",\"f\",IF($F41=\"\",\"\",IF(AND(AA41>0,Schueler22Punkte!$N2=\"\"),\"F\",IF(Schueler22Punkte!$N2=\"\",\"\",Schueler22Punkte!$N2)))))","v":""},{"$f":"IF(Schueler23Punkte!$D$1=0,\"\",IF(Schueler23Punkte!$M2=\"F\",\"f\",IF($F41=\"\",\"\",IF(AND(AB41>0,Schueler23Punkte!$N2=\"\"),\"F\",IF(Schueler23Punkte!$N2=\"\",\"\",Schueler23Punkte!$N2)))))","v":""},{"$f":"IF(Schueler24Punkte!$D$1=0,\"\",IF(Schueler24Punkte!$M2=\"F\",\"f\",IF($F41=\"\",\"\",IF(AND(AC41>0,Schueler24Punkte!$N2=\"\"),\"F\",IF(Schueler24Punkte!$N2=\"\",\"\",Schueler24Punkte!$N2)))))","v":""},{"$f":"IF(Schueler25Punkte!$D$1=0,\"\",IF(Schueler25Punkte!$M2=\"F\",\"f\",IF($F41=\"\",\"\",IF(AND(AD41>0,Schueler25Punkte!$N2=\"\"),\"F\",IF(Schueler25Punkte!$N2=\"\",\"\",Schueler25Punkte!$N2)))))","v":""},{"$f":"IF(Schueler26Punkte!$D$1=0,\"\",IF(Schueler26Punkte!$M2=\"F\",\"f\",IF($F41=\"\",\"\",IF(AND(AE41>0,Schueler26Punkte!$N2=\"\"),\"F\",IF(Schueler26Punkte!$N2=\"\",\"\",Schueler26Punkte!$N2)))))","v":""},{"$f":"IF(Schueler27Punkte!$D$1=0,\"\",IF(Schueler27Punkte!$M2=\"F\",\"f\",IF($F41=\"\",\"\",IF(AND(AF41>0,Schueler27Punkte!$N2=\"\"),\"F\",IF(Schueler27Punkte!$N2=\"\",\"\",Schueler27Punkte!$N2)))))","v":""},{"$f":"IF(Schueler28Punkte!$D$1=0,\"\",IF(Schueler28Punkte!$M2=\"F\",\"f\",IF($F41=\"\",\"\",IF(AND(AG41>0,Schueler28Punkte!$N2=\"\"),\"F\",IF(Schueler28Punkte!$N2=\"\",\"\",Schueler28Punkte!$N2)))))","v":""},{"$f":"IF(Schueler29Punkte!$D$1=0,\"\",IF(Schueler29Punkte!$M2=\"F\",\"f\",IF($F41=\"\",\"\",IF(AND(AH41>0,Schueler29Punkte!$N2=\"\"),\"F\",IF(Schueler29Punkte!$N2=\"\",\"\",Schueler29Punkte!$N2)))))","v":""},{"$f":"IF(Schueler30Punkte!$D$1=0,\"\",IF(Schueler30Punkte!$M2=\"F\",\"f\",IF($F41=\"\",\"\",IF(AND(AI41>0,Schueler30Punkte!$N2=\"\"),\"F\",IF(Schueler30Punkte!$N2=\"\",\"\",Schueler30Punkte!$N2)))))","v":""},{"$f":"SUM(G41:AJ41)/((COUNTIF(G41:AJ41,0)+COUNTIF(G41:AJ41,1)+COUNTIF(G41:AJ41,2)+COUNTIF(G41:AJ41,3)+COUNTIF(G41:AJ41,4)+COUNTIF(G41:AJ41,5)+COUNTIF(G41:AJ41,6)+COUNTIF(G41:AJ41,7)+COUNTIF(G41:AJ41,8)+COUNTIF(G41:AJ41,9)+COUNTIF(G41:AJ41,10))*F41)","v":{"$error":"#DIV/0!"}}]
[2,"IT2",null,null,null,4,{"$f":"IF(Schueler1Punkte!$D$1=0,\"\",IF(Schueler1Punkte!$M3=\"F\",\"f\",IF($F42=\"\",\"\",IF(AND(F42>0,Schueler1Punkte!$N3=\"\"),\"F\",IF(Schueler1Punkte!$N3=\"\",\"\",Schueler1Punkte!$N3)))))","v":""},{"$f":"IF(Schueler2Punkte!$D$1=0,\"\",IF(Schueler2Punkte!$M3=\"F\",\"f\",IF($F42=\"\",\"\",IF(AND(G42>0,Schueler2Punkte!$N3=\"\"),\"F\",IF(Schueler2Punkte!$N3=\"\",\"\",Schueler2Punkte!$N3)))))","v":""},{"$f":"IF(Schueler3Punkte!$D$1=0,\"\",IF(Schueler3Punkte!$M3=\"F\",\"f\",IF($F42=\"\",\"\",IF(AND(H42>0,Schueler3Punkte!$N3=\"\"),\"F\",IF(Schueler3Punkte!$N3=\"\",\"\",Schueler3Punkte!$N3)))))","v":""},{"$f":"IF(Schueler4Punkte!$D$1=0,\"\",IF(Schueler4Punkte!$M3=\"F\",\"f\",IF($F42=\"\",\"\",IF(AND(I42>0,Schueler4Punkte!$N3=\"\"),\"F\",IF(Schueler4Punkte!$N3=\"\",\"\",Schueler4Punkte!$N3)))))","v":""},{"$f":"IF(Schueler5Punkte!$D$1=0,\"\",IF(Schueler5Punkte!$M3=\"F\",\"f\",IF($F42=\"\",\"\",IF(AND(J42>0,Schueler5Punkte!$N3=\"\"),\"F\",IF(Schueler5Punkte!$N3=\"\",\"\",Schueler5Punkte!$N3)))))","v":""},{"$f":"IF(Schueler6Punkte!$D$1=0,\"\",IF(Schueler6Punkte!$M3=\"F\",\"f\",IF($F42=\"\",\"\",IF(AND(K42>0,Schueler6Punkte!$N3=\"\"),\"F\",IF(Schueler6Punkte!$N3=\"\",\"\",Schueler6Punkte!$N3)))))","v":""},{"$f":"IF(Schueler7Punkte!$D$1=0,\"\",IF(Schueler7Punkte!$M3=\"F\",\"f\",IF($F42=\"\",\"\",IF(AND(L42>0,Schueler7Punkte!$N3=\"\"),\"F\",IF(Schueler7Punkte!$N3=\"\",\"\",Schueler7Punkte!$N3)))))","v":""},{"$f":"IF(Schueler8Punkte!$D$1=0,\"\",IF(Schueler8Punkte!$M3=\"F\",\"f\",IF($F42=\"\",\"\",IF(AND(M42>0,Schueler8Punkte!$N3=\"\"),\"F\",IF(Schueler8Punkte!$N3=\"\",\"\",Schueler8Punkte!$N3)))))","v":""},{"$f":"IF(Schueler9Punkte!$D$1=0,\"\",IF(Schueler9Punkte!$M3=\"F\",\"f\",IF($F42=\"\",\"\",IF(AND(N42>0,Schueler9Punkte!$N3=\"\"),\"F\",IF(Schueler9Punkte!$N3=\"\",\"\",Schueler9Punkte!$N3)))))","v":""},{"$f":"IF(Schueler10Punkte!$D$1=0,\"\",IF(Schueler10Punkte!$M3=\"F\",\"f\",IF($F42=\"\",\"\",IF(AND(O42>0,Schueler10Punkte!$N3=\"\"),\"F\",IF(Schueler10Punkte!$N3=\"\",\"\",Schueler10Punkte!$N3)))))","v":""},{"$f":"IF(Schueler11Punkte!$D$1=0,\"\",IF(Schueler11Punkte!$M3=\"F\",\"f\",IF($F42=\"\",\"\",IF(AND(P42>0,Schueler11Punkte!$N3=\"\"),\"F\",IF(Schueler11Punkte!$N3=\"\",\"\",Schueler11Punkte!$N3)))))","v":""},{"$f":"IF(Schueler12Punkte!$D$1=0,\"\",IF(Schueler12Punkte!$M3=\"F\",\"f\",IF($F42=\"\",\"\",IF(AND(Q42>0,Schueler12Punkte!$N3=\"\"),\"F\",IF(Schueler12Punkte!$N3=\"\",\"\",Schueler12Punkte!$N3)))))","v":""},{"$f":"IF(Schueler13Punkte!$D$1=0,\"\",IF(Schueler13Punkte!$M3=\"F\",\"f\",IF($F42=\"\",\"\",IF(AND(R42>0,Schueler13Punkte!$N3=\"\"),\"F\",IF(Schueler13Punkte!$N3=\"\",\"\",Schueler13Punkte!$N3)))))","v":""},{"$f":"IF(Schueler14Punkte!$D$1=0,\"\",IF(Schueler14Punkte!$M3=\"F\",\"f\",IF($F42=\"\",\"\",IF(AND(S42>0,Schueler14Punkte!$N3=\"\"),\"F\",IF(Schueler14Punkte!$N3=\"\",\"\",Schueler14Punkte!$N3)))))","v":""},{"$f":"IF(Schueler15Punkte!$D$1=0,\"\",IF(Schueler15Punkte!$M3=\"F\",\"f\",IF($F42=\"\",\"\",IF(AND(T42>0,Schueler15Punkte!$N3=\"\"),\"F\",IF(Schueler15Punkte!$N3=\"\",\"\",Schueler15Punkte!$N3)))))","v":""},{"$f":"IF(Schueler16Punkte!$D$1=0,\"\",IF(Schueler16Punkte!$M3=\"F\",\"f\",IF($F42=\"\",\"\",IF(AND(U42>0,Schueler16Punkte!$N3=\"\"),\"F\",IF(Schueler16Punkte!$N3=\"\",\"\",Schueler16Punkte!$N3)))))","v":""},{"$f":"IF(Schueler17Punkte!$D$1=0,\"\",IF(Schueler17Punkte!$M3=\"F\",\"f\",IF($F42=\"\",\"\",IF(AND(V42>0,Schueler17Punkte!$N3=\"\"),\"F\",IF(Schueler17Punkte!$N3=\"\",\"\",Schueler17Punkte!$N3)))))","v":""},{"$f":"IF(Schueler18Punkte!$D$1=0,\"\",IF(Schueler18Punkte!$M3=\"F\",\"f\",IF($F42=\"\",\"\",IF(AND(W42>0,Schueler18Punkte!$N3=\"\"),\"F\",IF(Schueler18Punkte!$N3=\"\",\"\",Schueler18Punkte!$N3)))))","v":""},{"$f":"IF(Schueler19Punkte!$D$1=0,\"\",IF(Schueler19Punkte!$M3=\"F\",\"f\",IF($F42=\"\",\"\",IF(AND(X42>0,Schueler19Punkte!$N3=\"\"),\"F\",IF(Schueler19Punkte!$N3=\"\",\"\",Schueler19Punkte!$N3)))))","v":""},{"$f":"IF(Schueler20Punkte!$D$1=0,\"\",IF(Schueler20Punkte!$M3=\"F\",\"f\",IF($F42=\"\",\"\",IF(AND(Y42>0,Schueler20Punkte!$N3=\"\"),\"F\",IF(Schueler20Punkte!$N3=\"\",\"\",Schueler20Punkte!$N3)))))","v":""},{"$f":"IF(Schueler21Punkte!$D$1=0,\"\",IF(Schueler21Punkte!$M3=\"F\",\"f\",IF($F42=\"\",\"\",IF(AND(Z42>0,Schueler21Punkte!$N3=\"\"),\"F\",IF(Schueler21Punkte!$N3=\"\",\"\",Schueler21Punkte!$N3)))))","v":""},{"$f":"IF(Schueler22Punkte!$D$1=0,\"\",IF(Schueler22Punkte!$M3=\"F\",\"f\",IF($F42=\"\",\"\",IF(AND(AA42>0,Schueler22Punkte!$N3=\"\"),\"F\",IF(Schueler22Punkte!$N3=\"\",\"\",Schueler22Punkte!$N3)))))","v":""},{"$f":"IF(Schueler23Punkte!$D$1=0,\"\",IF(Schueler23Punkte!$M3=\"F\",\"f\",IF($F42=\"\",\"\",IF(AND(AB42>0,Schueler23Punkte!$N3=\"\"),\"F\",IF(Schueler23Punkte!$N3=\"\",\"\",Schueler23Punkte!$N3)))))","v":""},{"$f":"IF(Schueler24Punkte!$D$1=0,\"\",IF(Schueler24Punkte!$M3=\"F\",\"f\",IF($F42=\"\",\"\",IF(AND(AC42>0,Schueler24Punkte!$N3=\"\"),\"F\",IF(Schueler24Punkte!$N3=\"\",\"\",Schueler24Punkte!$N3)))))","v":""},{"$f":"IF(Schueler25Punkte!$D$1=0,\"\",IF(Schueler25Punkte!$M3=\"F\",\"f\",IF($F42=\"\",\"\",IF(AND(AD42>0,Schueler25Punkte!$N3=\"\"),\"F\",IF(Schueler25Punkte!$N3=\"\",\"\",Schueler25Punkte!$N3)))))","v":""},{"$f":"IF(Schueler26Punkte!$D$1=0,\"\",IF(Schueler26Punkte!$M3=\"F\",\"f\",IF($F42=\"\",\"\",IF(AND(AE42>0,Schueler26Punkte!$N3=\"\"),\"F\",IF(Schueler26Punkte!$N3=\"\",\"\",Schueler26Punkte!$N3)))))","v":""},{"$f":"IF(Schueler27Punkte!$D$1=0,\"\",IF(Schueler27Punkte!$M3=\"F\",\"f\",IF($F42=\"\",\"\",IF(AND(AF42>0,Schueler27Punkte!$N3=\"\"),\"F\",IF(Schueler27Punkte!$N3=\"\",\"\",Schueler27Punkte!$N3)))))","v":""},{"$f":"IF(Schueler28Punkte!$D$1=0,\"\",IF(Schueler28Punkte!$M3=\"F\",\"f\",IF($F42=\"\",\"\",IF(AND(AG42>0,Schueler28Punkte!$N3=\"\"),\"F\",IF(Schueler28Punkte!$N3=\"\",\"\",Schueler28Punkte!$N3)))))","v":""},{"$f":"IF(Schueler29Punkte!$D$1=0,\"\",IF(Schueler29Punkte!$M3=\"F\",\"f\",IF($F42=\"\",\"\",IF(AND(AH42>0,Schueler29Punkte!$N3=\"\"),\"F\",IF(Schueler29Punkte!$N3=\"\",\"\",Schueler29Punkte!$N3)))))","v":""},{"$f":"IF(Schueler30Punkte!$D$1=0,\"\",IF(Schueler30Punkte!$M3=\"F\",\"f\",IF($F42=\"\",\"\",IF(AND(AI42>0,Schueler30Punkte!$N3=\"\"),\"F\",IF(Schueler30Punkte!$N3=\"\",\"\",Schueler30Punkte!$N3)))))","v":""},{"$f":"SUM(G42:AJ42)/((COUNTIF(G42:AJ42,0)+COUNTIF(G42:AJ42,1)+COUNTIF(G42:AJ42,2)+COUNTIF(G42:AJ42,3)+COUNTIF(G42:AJ42,4)+COUNTIF(G42:AJ42,5)+COUNTIF(G42:AJ42,6)+COUNTIF(G42:AJ42,7)+COUNTIF(G42:AJ42,8)+COUNTIF(G42:AJ42,9)+COUNTIF(G42:AJ42,10))*F42)","v":{"$error":"#DIV/0!"}}]
[3,"IT3",null,null,null,2,{"$f":"IF(Schueler1Punkte!$D$1=0,\"\",IF(Schueler1Punkte!$M4=\"F\",\"f\",IF($F43=\"\",\"\",IF(AND(F43>0,Schueler1Punkte!$N4=\"\"),\"F\",IF(Schueler1Punkte!$N4=\"\",\"\",Schueler1Punkte!$N4)))))","v":""},{"$f":"IF(Schueler2Punkte!$D$1=0,\"\",IF(Schueler2Punkte!$M4=\"F\",\"f\",IF($F43=\"\",\"\",IF(AND(G43>0,Schueler2Punkte!$N4=\"\"),\"F\",IF(Schueler2Punkte!$N4=\"\",\"\",Schueler2Punkte!$N4)))))","v":""},{"$f":"IF(Schueler3Punkte!$D$1=0,\"\",IF(Schueler3Punkte!$M4=\"F\",\"f\",IF($F43=\"\",\"\",IF(AND(H43>0,Schueler3Punkte!$N4=\"\"),\"F\",IF(Schueler3Punkte!$N4=\"\",\"\",Schueler3Punkte!$N4)))))","v":""},{"$f":"IF(Schueler4Punkte!$D$1=0,\"\",IF(Schueler4Punkte!$M4=\"F\",\"f\",IF($F43=\"\",\"\",IF(AND(I43>0,Schueler4Punkte!$N4=\"\"),\"F\",IF(Schueler4Punkte!$N4=\"\",\"\",Schueler4Punkte!$N4)))))","v":""},{"$f":"IF(Schueler5Punkte!$D$1=0,\"\",IF(Schueler5Punkte!$M4=\"F\",\"f\",IF($F43=\"\",\"\",IF(AND(J43>0,Schueler5Punkte!$N4=\"\"),\"F\",IF(Schueler5Punkte!$N4=\"\",\"\",Schueler5Punkte!$N4)))))","v":""},{"$f":"IF(Schueler6Punkte!$D$1=0,\"\",IF(Schueler6Punkte!$M4=\"F\",\"f\",IF($F43=\"\",\"\",IF(AND(K43>0,Schueler6Punkte!$N4=\"\"),\"F\",IF(Schueler6Punkte!$N4=\"\",\"\",Schueler6Punkte!$N4)))))","v":""},{"$f":"IF(Schueler7Punkte!$D$1=0,\"\",IF(Schueler7Punkte!$M4=\"F\",\"f\",IF($F43=\"\",\"\",IF(AND(L43>0,Schueler7Punkte!$N4=\"\"),\"F\",IF(Schueler7Punkte!$N4=\"\",\"\",Schueler7Punkte!$N4)))))","v":""},{"$f":"IF(Schueler8Punkte!$D$1=0,\"\",IF(Schueler8Punkte!$M4=\"F\",\"f\",IF($F43=\"\",\"\",IF(AND(M43>0,Schueler8Punkte!$N4=\"\"),\"F\",IF(Schueler8Punkte!$N4=\"\",\"\",Schueler8Punkte!$N4)))))","v":""},{"$f":"IF(Schueler9Punkte!$D$1=0,\"\",IF(Schueler9Punkte!$M4=\"F\",\"f\",IF($F43=\"\",\"\",IF(AND(N43>0,Schueler9Punkte!$N4=\"\"),\"F\",IF(Schueler9Punkte!$N4=\"\",\"\",Schueler9Punkte!$N4)))))","v":""},{"$f":"IF(Schueler10Punkte!$D$1=0,\"\",IF(Schueler10Punkte!$M4=\"F\",\"f\",IF($F43=\"\",\"\",IF(AND(O43>0,Schueler10Punkte!$N4=\"\"),\"F\",IF(Schueler10Punkte!$N4=\"\",\"\",Schueler10Punkte!$N4)))))","v":""},{"$f":"IF(Schueler11Punkte!$D$1=0,\"\",IF(Schueler11Punkte!$M4=\"F\",\"f\",IF($F43=\"\",\"\",IF(AND(P43>0,Schueler11Punkte!$N4=\"\"),\"F\",IF(Schueler11Punkte!$N4=\"\",\"\",Schueler11Punkte!$N4)))))","v":""},{"$f":"IF(Schueler12Punkte!$D$1=0,\"\",IF(Schueler12Punkte!$M4=\"F\",\"f\",IF($F43=\"\",\"\",IF(AND(Q43>0,Schueler12Punkte!$N4=\"\"),\"F\",IF(Schueler12Punkte!$N4=\"\",\"\",Schueler12Punkte!$N4)))))","v":""},{"$f":"IF(Schueler13Punkte!$D$1=0,\"\",IF(Schueler13Punkte!$M4=\"F\",\"f\",IF($F43=\"\",\"\",IF(AND(R43>0,Schueler13Punkte!$N4=\"\"),\"F\",IF(Schueler13Punkte!$N4=\"\",\"\",Schueler13Punkte!$N4)))))","v":""},{"$f":"IF(Schueler14Punkte!$D$1=0,\"\",IF(Schueler14Punkte!$M4=\"F\",\"f\",IF($F43=\"\",\"\",IF(AND(S43>0,Schueler14Punkte!$N4=\"\"),\"F\",IF(Schueler14Punkte!$N4=\"\",\"\",Schueler14Punkte!$N4)))))","v":""},{"$f":"IF(Schueler15Punkte!$D$1=0,\"\",IF(Schueler15Punkte!$M4=\"F\",\"f\",IF($F43=\"\",\"\",IF(AND(T43>0,Schueler15Punkte!$N4=\"\"),\"F\",IF(Schueler15Punkte!$N4=\"\",\"\",Schueler15Punkte!$N4)))))","v":""},{"$f":"IF(Schueler16Punkte!$D$1=0,\"\",IF(Schueler16Punkte!$M4=\"F\",\"f\",IF($F43=\"\",\"\",IF(AND(U43>0,Schueler16Punkte!$N4=\"\"),\"F\",IF(Schueler16Punkte!$N4=\"\",\"\",Schueler16Punkte!$N4)))))","v":""},{"$f":"IF(Schueler17Punkte!$D$1=0,\"\",IF(Schueler17Punkte!$M4=\"F\",\"f\",IF($F43=\"\",\"\",IF(AND(V43>0,Schueler17Punkte!$N4=\"\"),\"F\",IF(Schueler17Punkte!$N4=\"\",\"\",Schueler17Punkte!$N4)))))","v":""},{"$f":"IF(Schueler18Punkte!$D$1=0,\"\",IF(Schueler18Punkte!$M4=\"F\",\"f\",IF($F43=\"\",\"\",IF(AND(W43>0,Schueler18Punkte!$N4=\"\"),\"F\",IF(Schueler18Punkte!$N4=\"\",\"\",Schueler18Punkte!$N4)))))","v":""},{"$f":"IF(Schueler19Punkte!$D$1=0,\"\",IF(Schueler19Punkte!$M4=\"F\",\"f\",IF($F43=\"\",\"\",IF(AND(X43>0,Schueler19Punkte!$N4=\"\"),\"F\",IF(Schueler19Punkte!$N4=\"\",\"\",Schueler19Punkte!$N4)))))","v":""},{"$f":"IF(Schueler20Punkte!$D$1=0,\"\",IF(Schueler20Punkte!$M4=\"F\",\"f\",IF($F43=\"\",\"\",IF(AND(Y43>0,Schueler20Punkte!$N4=\"\"),\"F\",IF(Schueler20Punkte!$N4=\"\",\"\",Schueler20Punkte!$N4)))))","v":""},{"$f":"IF(Schueler21Punkte!$D$1=0,\"\",IF(Schueler21Punkte!$M4=\"F\",\"f\",IF($F43=\"\",\"\",IF(AND(Z43>0,Schueler21Punkte!$N4=\"\"),\"F\",IF(Schueler21Punkte!$N4=\"\",\"\",Schueler21Punkte!$N4)))))","v":""},{"$f":"IF(Schueler22Punkte!$D$1=0,\"\",IF(Schueler22Punkte!$M4=\"F\",\"f\",IF($F43=\"\",\"\",IF(AND(AA43>0,Schueler22Punkte!$N4=\"\"),\"F\",IF(Schueler22Punkte!$N4=\"\",\"\",Schueler22Punkte!$N4)))))","v":""},{"$f":"IF(Schueler23Punkte!$D$1=0,\"\",IF(Schueler23Punkte!$M4=\"F\",\"f\",IF($F43=\"\",\"\",IF(AND(AB43>0,Schueler23Punkte!$N4=\"\"),\"F\",IF(Schueler23Punkte!$N4=\"\",\"\",Schueler23Punkte!$N4)))))","v":""},{"$f":"IF(Schueler24Punkte!$D$1=0,\"\",IF(Schueler24Punkte!$M4=\"F\",\"f\",IF($F43=\"\",\"\",IF(AND(AC43>0,Schueler24Punkte!$N4=\"\"),\"F\",IF(Schueler24Punkte!$N4=\"\",\"\",Schueler24Punkte!$N4)))))","v":""},{"$f":"IF(Schueler25Punkte!$D$1=0,\"\",IF(Schueler25Punkte!$M4=\"F\",\"f\",IF($F43=\"\",\"\",IF(AND(AD43>0,Schueler25Punkte!$N4=\"\"),\"F\",IF(Schueler25Punkte!$N4=\"\",\"\",Schueler25Punkte!$N4)))))","v":""},{"$f":"IF(Schueler26Punkte!$D$1=0,\"\",IF(Schueler26Punkte!$M4=\"F\",\"f\",IF($F43=\"\",\"\",IF(AND(AE43>0,Schueler26Punkte!$N4=\"\"),\"F\",IF(Schueler26Punkte!$N4=\"\",\"\",Schueler26Punkte!$N4)))))","v":""},{"$f":"IF(Schueler27Punkte!$D$1=0,\"\",IF(Schueler27Punkte!$M4=\"F\",\"f\",IF($F43=\"\",\"\",IF(AND(AF43>0,Schueler27Punkte!$N4=\"\"),\"F\",IF(Schueler27Punkte!$N4=\"\",\"\",Schueler27Punkte!$N4)))))","v":""},{"$f":"IF(Schueler28Punkte!$D$1=0,\"\",IF(Schueler28Punkte!$M4=\"F\",\"f\",IF($F43=\"\",\"\",IF(AND(AG43>0,Schueler28Punkte!$N4=\"\"),\"F\",IF(Schueler28Punkte!$N4=\"\",\"\",Schueler28Punkte!$N4)))))","v":""},{"$f":"IF(Schueler29Punkte!$D$1=0,\"\",IF(Schueler29Punkte!$M4=\"F\",\"f\",IF($F43=\"\",\"\",IF(AND(AH43>0,Schueler29Punkte!$N4=\"\"),\"F\",IF(Schueler29Punkte!$N4=\"\",\"\",Schueler29Punkte!$N4)))))","v":""},{"$f":"IF(Schueler30Punkte!$D$1=0,\"\",IF(Schueler30Punkte!$M4=\"F\",\"f\",IF($F43=\"\",\"\",IF(AND(AI43>0,Schueler30Punkte!$N4=\"\"),\"F\",IF(Schueler30Punkte!$N4=\"\",\"\",Schueler30Punkte!$N4)))))","v":""},{"$error":"#DIV/0!"}]
[4,"IT4",null,null,null,2,{"$f":"IF(Schueler1Punkte!$D$1=0,\"\",IF(Schueler1Punkte!$M5=\"F\",\"f\",IF($F44=\"\",\"\",IF(AND(F44>0,Schueler1Punkte!$N5=\"\"),\"F\",IF(Schueler1Punkte!$N5=\"\",\"\",Schueler1Punkte!$N5)))))","v":""},{"$f":"IF(Schueler2Punkte!$D$1=0,\"\",IF(Schueler2Punkte!$M5=\"F\",\"f\",IF($F44=\"\",\"\",IF(AND(G44>0,Schueler2Punkte!$N5=\"\"),\"F\",IF(Schueler2Punkte!$N5=\"\",\"\",Schueler2Punkte!$N5)))))","v":""},{"$f":"IF(Schueler3Punkte!$D$1=0,\"\",IF(Schueler3Punkte!$M5=\"F\",\"f\",IF($F44=\"\",\"\",IF(AND(H44>0,Schueler3Punkte!$N5=\"\"),\"F\",IF(Schueler3Punkte!$N5=\"\",\"\",Schueler3Punkte!$N5)))))","v":""},{"$f":"IF(Schueler4Punkte!$D$1=0,\"\",IF(Schueler4Punkte!$M5=\"F\",\"f\",IF($F44=\"\",\"\",IF(AND(I44>0,Schueler4Punkte!$N5=\"\"),\"F\",IF(Schueler4Punkte!$N5=\"\",\"\",Schueler4Punkte!$N5)))))","v":""},{"$f":"IF(Schueler5Punkte!$D$1=0,\"\",IF(Schueler5Punkte!$M5=\"F\",\"f\",IF($F44=\"\",\"\",IF(AND(J44>0,Schueler5Punkte!$N5=\"\"),\"F\",IF(Schueler5Punkte!$N5=\"\",\"\",Schueler5Punkte!$N5)))))","v":""},{"$f":"IF(Schueler6Punkte!$D$1=0,\"\",IF(Schueler6Punkte!$M5=\"F\",\"f\",IF($F44=\"\",\"\",IF(AND(K44>0,Schueler6Punkte!$N5=\"\"),\"F\",IF(Schueler6Punkte!$N5=\"\",\"\",Schueler6Punkte!$N5)))))","v":""},{"$f":"IF(Schueler7Punkte!$D$1=0,\"\",IF(Schueler7Punkte!$M5=\"F\",\"f\",IF($F44=\"\",\"\",IF(AND(L44>0,Schueler7Punkte!$N5=\"\"),\"F\",IF(Schueler7Punkte!$N5=\"\",\"\",Schueler7Punkte!$N5)))))","v":""},{"$f":"IF(Schueler8Punkte!$D$1=0,\"\",IF(Schueler8Punkte!$M5=\"F\",\"f\",IF($F44=\"\",\"\",IF(AND(M44>0,Schueler8Punkte!$N5=\"\"),\"F\",IF(Schueler8Punkte!$N5=\"\",\"\",Schueler8Punkte!$N5)))))","v":""},{"$f":"IF(Schueler9Punkte!$D$1=0,\"\",IF(Schueler9Punkte!$M5=\"F\",\"f\",IF($F44=\"\",\"\",IF(AND(N44>0,Schueler9Punkte!$N5=\"\"),\"F\",IF(Schueler9Punkte!$N5=\"\",\"\",Schueler9Punkte!$N5)))))","v":""},{"$f":"IF(Schueler10Punkte!$D$1=0,\"\",IF(Schueler10Punkte!$M5=\"F\",\"f\",IF($F44=\"\",\"\",IF(AND(O44>0,Schueler10Punkte!$N5=\"\"),\"F\",IF(Schueler10Punkte!$N5=\"\",\"\",Schueler10Punkte!$N5)))))","v":""},{"$f":"IF(Schueler11Punkte!$D$1=0,\"\",IF(Schueler11Punkte!$M5=\"F\",\"f\",IF($F44=\"\",\"\",IF(AND(P44>0,Schueler11Punkte!$N5=\"\"),\"F\",IF(Schueler11Punkte!$N5=\"\",\"\",Schueler11Punkte!$N5)))))","v":""},{"$f":"IF(Schueler12Punkte!$D$1=0,\"\",IF(Schueler12Punkte!$M5=\"F\",\"f\",IF($F44=\"\",\"\",IF(AND(Q44>0,Schueler12Punkte!$N5=\"\"),\"F\",IF(Schueler12Punkte!$N5=\"\",\"\",Schueler12Punkte!$N5)))))","v":""},{"$f":"IF(Schueler13Punkte!$D$1=0,\"\",IF(Schueler13Punkte!$M5=\"F\",\"f\",IF($F44=\"\",\"\",IF(AND(R44>0,Schueler13Punkte!$N5=\"\"),\"F\",IF(Schueler13Punkte!$N5=\"\",\"\",Schueler13Punkte!$N5)))))","v":""},{"$f":"IF(Schueler14Punkte!$D$1=0,\"\",IF(Schueler14Punkte!$M5=\"F\",\"f\",IF($F44=\"\",\"\",IF(AND(S44>0,Schueler14Punkte!$N5=\"\"),\"F\",IF(Schueler14Punkte!$N5=\"\",\"\",Schueler14Punkte!$N5)))))","v":""},{"$f":"IF(Schueler15Punkte!$D$1=0,\"\",IF(Schueler15Punkte!$M5=\"F\",\"f\",IF($F44=\"\",\"\",IF(AND(T44>0,Schueler15Punkte!$N5=\"\"),\"F\",IF(Schueler15Punkte!$N5=\"\",\"\",Schueler15Punkte!$N5)))))","v":""},{"$f":"IF(Schueler16Punkte!$D$1=0,\"\",IF(Schueler16Punkte!$M5=\"F\",\"f\",IF($F44=\"\",\"\",IF(AND(U44>0,Schueler16Punkte!$N5=\"\"),\"F\",IF(Schueler16Punkte!$N5=\"\",\"\",Schueler16Punkte!$N5)))))","v":""},{"$f":"IF(Schueler17Punkte!$D$1=0,\"\",IF(Schueler17Punkte!$M5=\"F\",\"f\",IF($F44=\"\",\"\",IF(AND(V44>0,Schueler17Punkte!$N5=\"\"),\"F\",IF(Schueler17Punkte!$N5=\"\",\"\",Schueler17Punkte!$N5)))))","v":""},{"$f":"IF(Schueler18Punkte!$D$1=0,\"\",IF(Schueler18Punkte!$M5=\"F\",\"f\",IF($F44=\"\",\"\",IF(AND(W44>0,Schueler18Punkte!$N5=\"\"),\"F\",IF(Schueler18Punkte!$N5=\"\",\"\",Schueler18Punkte!$N5)))))","v":""},{"$f":"IF(Schueler19Punkte!$D$1=0,\"\",IF(Schueler19Punkte!$M5=\"F\",\"f\",IF($F44=\"\",\"\",IF(AND(X44>0,Schueler19Punkte!$N5=\"\"),\"F\",IF(Schueler19Punkte!$N5=\"\",\"\",Schueler19Punkte!$N5)))))","v":""},{"$f":"IF(Schueler20Punkte!$D$1=0,\"\",IF(Schueler20Punkte!$M5=\"F\",\"f\",IF($F44=\"\",\"\",IF(AND(Y44>0,Schueler20Punkte!$N5=\"\"),\"F\",IF(Schueler20Punkte!$N5=\"\",\"\",Schueler20Punkte!$N5)))))","v":""},{"$f":"IF(Schueler21Punkte!$D$1=0,\"\",IF(Schueler21Punkte!$M5=\"F\",\"f\",IF($F44=\"\",\"\",IF(AND(Z44>0,Schueler21Punkte!$N5=\"\"),\"F\",IF(Schueler21Punkte!$N5=\"\",\"\",Schueler21Punkte!$N5)))))","v":""},{"$f":"IF(Schueler22Punkte!$D$1=0,\"\",IF(Schueler22Punkte!$M5=\"F\",\"f\",IF($F44=\"\",\"\",IF(AND(AA44>0,Schueler22Punkte!$N5=\"\"),\"F\",IF(Schueler22Punkte!$N5=\"\",\"\",Schueler22Punkte!$N5)))))","v":""},{"$f":"IF(Schueler23Punkte!$D$1=0,\"\",IF(Schueler23Punkte!$M5=\"F\",\"f\",IF($F44=\"\",\"\",IF(AND(AB44>0,Schueler23Punkte!$N5=\"\"),\"F\",IF(Schueler23Punkte!$N5=\"\",\"\",Schueler23Punkte!$N5)))))","v":""},{"$f":"IF(Schueler24Punkte!$D$1=0,\"\",IF(Schueler24Punkte!$M5=\"F\",\"f\",IF($F44=\"\",\"\",IF(AND(AC44>0,Schueler24Punkte!$N5=\"\"),\"F\",IF(Schueler24Punkte!$N5=\"\",\"\",Schueler24Punkte!$N5)))))","v":""},{"$f":"IF(Schueler25Punkte!$D$1=0,\"\",IF(Schueler25Punkte!$M5=\"F\",\"f\",IF($F44=\"\",\"\",IF(AND(AD44>0,Schueler25Punkte!$N5=\"\"),\"F\",IF(Schueler25Punkte!$N5=\"\",\"\",Schueler25Punkte!$N5)))))","v":""},{"$f":"IF(Schueler26Punkte!$D$1=0,\"\",IF(Schueler26Punkte!$M5=\"F\",\"f\",IF($F44=\"\",\"\",IF(AND(AE44>0,Schueler26Punkte!$N5=\"\"),\"F\",IF(Schueler26Punkte!$N5=\"\",\"\",Schueler26Punkte!$N5)))))","v":""},{"$f":"IF(Schueler27Punkte!$D$1=0,\"\",IF(Schueler27Punkte!$M5=\"F\",\"f\",IF($F44=\"\",\"\",IF(AND(AF44>0,Schueler27Punkte!$N5=\"\"),\"F\",IF(Schueler27Punkte!$N5=\"\",\"\",Schueler27Punkte!$N5)))))","v":""},{"$f":"IF(Schueler28Punkte!$D$1=0,\"\",IF(Schueler28Punkte!$M5=\"F\",\"f\",IF($F44=\"\",\"\",IF(AND(AG44>0,Schueler28Punkte!$N5=\"\"),\"F\",IF(Schueler28Punkte!$N5=\"\",\"\",Schueler28Punkte!$N5)))))","v":""},{"$f":"IF(Schueler29Punkte!$D$1=0,\"\",IF(Schueler29Punkte!$M5=\"F\",\"f\",IF($F44=\"\",\"\",IF(AND(AH44>0,Schueler29Punkte!$N5=\"\"),\"F\",IF(Schueler29Punkte!$N5=\"\",\"\",Schueler29Punkte!$N5)))))","v":""},{"$f":"IF(Schueler30Punkte!$D$1=0,\"\",IF(Schueler30Punkte!$M5=\"F\",\"f\",IF($F44=\"\",\"\",IF(AND(AI44>0,Schueler30Punkte!$N5=\"\"),\"F\",IF(Schueler30Punkte!$N5=\"\",\"\",Schueler30Punkte!$N5)))))","v":""},{"$error":"#DIV/0!"}]
[5,"IT5",null,null,null,2,{"$f":"IF(Schueler1Punkte!$D$1=0,\"\",IF(Schueler1Punkte!$M6=\"F\",\"f\",IF($F45=\"\",\"\",IF(AND(F45>0,Schueler1Punkte!$N6=\"\"),\"F\",IF(Schueler1Punkte!$N6=\"\",\"\",Schueler1Punkte!$N6)))))","v":""},{"$f":"IF(Schueler2Punkte!$D$1=0,\"\",IF(Schueler2Punkte!$M6=\"F\",\"f\",IF($F45=\"\",\"\",IF(AND(G45>0,Schueler2Punkte!$N6=\"\"),\"F\",IF(Schueler2Punkte!$N6=\"\",\"\",Schueler2Punkte!$N6)))))","v":""},{"$f":"IF(Schueler3Punkte!$D$1=0,\"\",IF(Schueler3Punkte!$M6=\"F\",\"f\",IF($F45=\"\",\"\",IF(AND(H45>0,Schueler3Punkte!$N6=\"\"),\"F\",IF(Schueler3Punkte!$N6=\"\",\"\",Schueler3Punkte!$N6)))))","v":""},{"$f":"IF(Schueler4Punkte!$D$1=0,\"\",IF(Schueler4Punkte!$M6=\"F\",\"f\",IF($F45=\"\",\"\",IF(AND(I45>0,Schueler4Punkte!$N6=\"\"),\"F\",IF(Schueler4Punkte!$N6=\"\",\"\",Schueler4Punkte!$N6)))))","v":""},{"$f":"IF(Schueler5Punkte!$D$1=0,\"\",IF(Schueler5Punkte!$M6=\"F\",\"f\",IF($F45=\"\",\"\",IF(AND(J45>0,Schueler5Punkte!$N6=\"\"),\"F\",IF(Schueler5Punkte!$N6=\"\",\"\",Schueler5Punkte!$N6)))))","v":""},{"$f":"IF(Schueler6Punkte!$D$1=0,\"\",IF(Schueler6Punkte!$M6=\"F\",\"f\",IF($F45=\"\",\"\",IF(AND(K45>0,Schueler6Punkte!$N6=\"\"),\"F\",IF(Schueler6Punkte!$N6=\"\",\"\",Schueler6Punkte!$N6)))))","v":""},{"$f":"IF(Schueler7Punkte!$D$1=0,\"\",IF(Schueler7Punkte!$M6=\"F\",\"f\",IF($F45=\"\",\"\",IF(AND(L45>0,Schueler7Punkte!$N6=\"\"),\"F\",IF(Schueler7Punkte!$N6=\"\",\"\",Schueler7Punkte!$N6)))))","v":""},{"$f":"IF(Schueler8Punkte!$D$1=0,\"\",IF(Schueler8Punkte!$M6=\"F\",\"f\",IF($F45=\"\",\"\",IF(AND(M45>0,Schueler8Punkte!$N6=\"\"),\"F\",IF(Schueler8Punkte!$N6=\"\",\"\",Schueler8Punkte!$N6)))))","v":""},{"$f":"IF(Schueler9Punkte!$D$1=0,\"\",IF(Schueler9Punkte!$M6=\"F\",\"f\",IF($F45=\"\",\"\",IF(AND(N45>0,Schueler9Punkte!$N6=\"\"),\"F\",IF(Schueler9Punkte!$N6=\"\",\"\",Schueler9Punkte!$N6)))))","v":""},{"$f":"IF(Schueler10Punkte!$D$1=0,\"\",IF(Schueler10Punkte!$M6=\"F\",\"f\",IF($F45=\"\",\"\",IF(AND(O45>0,Schueler10Punkte!$N6=\"\"),\"F\",IF(Schueler10Punkte!$N6=\"\",\"\",Schueler10Punkte!$N6)))))","v":""},{"$f":"IF(Schueler11Punkte!$D$1=0,\"\",IF(Schueler11Punkte!$M6=\"F\",\"f\",IF($F45=\"\",\"\",IF(AND(P45>0,Schueler11Punkte!$N6=\"\"),\"F\",IF(Schueler11Punkte!$N6=\"\",\"\",Schueler11Punkte!$N6)))))","v":""},{"$f":"IF(Schueler12Punkte!$D$1=0,\"\",IF(Schueler12Punkte!$M6=\"F\",\"f\",IF($F45=\"\",\"\",IF(AND(Q45>0,Schueler12Punkte!$N6=\"\"),\"F\",IF(Schueler12Punkte!$N6=\"\",\"\",Schueler12Punkte!$N6)))))","v":""},{"$f":"IF(Schueler13Punkte!$D$1=0,\"\",IF(Schueler13Punkte!$M6=\"F\",\"f\",IF($F45=\"\",\"\",IF(AND(R45>0,Schueler13Punkte!$N6=\"\"),\"F\",IF(Schueler13Punkte!$N6=\"\",\"\",Schueler13Punkte!$N6)))))","v":""},{"$f":"IF(Schueler14Punkte!$D$1=0,\"\",IF(Schueler14Punkte!$M6=\"F\",\"f\",IF($F45=\"\",\"\",IF(AND(S45>0,Schueler14Punkte!$N6=\"\"),\"F\",IF(Schueler14Punkte!$N6=\"\",\"\",Schueler14Punkte!$N6)))))","v":""},{"$f":"IF(Schueler15Punkte!$D$1=0,\"\",IF(Schueler15Punkte!$M6=\"F\",\"f\",IF($F45=\"\",\"\",IF(AND(T45>0,Schueler15Punkte!$N6=\"\"),\"F\",IF(Schueler15Punkte!$N6=\"\",\"\",Schueler15Punkte!$N6)))))","v":""},{"$f":"IF(Schueler16Punkte!$D$1=0,\"\",IF(Schueler16Punkte!$M6=\"F\",\"f\",IF($F45=\"\",\"\",IF(AND(U45>0,Schueler16Punkte!$N6=\"\"),\"F\",IF(Schueler16Punkte!$N6=\"\",\"\",Schueler16Punkte!$N6)))))","v":""},{"$f":"IF(Schueler17Punkte!$D$1=0,\"\",IF(Schueler17Punkte!$M6=\"F\",\"f\",IF($F45=\"\",\"\",IF(AND(V45>0,Schueler17Punkte!$N6=\"\"),\"F\",IF(Schueler17Punkte!$N6=\"\",\"\",Schueler17Punkte!$N6)))))","v":""},{"$f":"IF(Schueler18Punkte!$D$1=0,\"\",IF(Schueler18Punkte!$M6=\"F\",\"f\",IF($F45=\"\",\"\",IF(AND(W45>0,Schueler18Punkte!$N6=\"\"),\"F\",IF(Schueler18Punkte!$N6=\"\",\"\",Schueler18Punkte!$N6)))))","v":""},{"$f":"IF(Schueler19Punkte!$D$1=0,\"\",IF(Schueler19Punkte!$M6=\"F\",\"f\",IF($F45=\"\",\"\",IF(AND(X45>0,Schueler19Punkte!$N6=\"\"),\"F\",IF(Schueler19Punkte!$N6=\"\",\"\",Schueler19Punkte!$N6)))))","v":""},{"$f":"IF(Schueler20Punkte!$D$1=0,\"\",IF(Schueler20Punkte!$M6=\"F\",\"f\",IF($F45=\"\",\"\",IF(AND(Y45>0,Schueler20Punkte!$N6=\"\"),\"F\",IF(Schueler20Punkte!$N6=\"\",\"\",Schueler20Punkte!$N6)))))","v":""},{"$f":"IF(Schueler21Punkte!$D$1=0,\"\",IF(Schueler21Punkte!$M6=\"F\",\"f\",IF($F45=\"\",\"\",IF(AND(Z45>0,Schueler21Punkte!$N6=\"\"),\"F\",IF(Schueler21Punkte!$N6=\"\",\"\",Schueler21Punkte!$N6)))))","v":""},{"$f":"IF(Schueler22Punkte!$D$1=0,\"\",IF(Schueler22Punkte!$M6=\"F\",\"f\",IF($F45=\"\",\"\",IF(AND(AA45>0,Schueler22Punkte!$N6=\"\"),\"F\",IF(Schueler22Punkte!$N6=\"\",\"\",Schueler22Punkte!$N6)))))","v":""},{"$f":"IF(Schueler23Punkte!$D$1=0,\"\",IF(Schueler23Punkte!$M6=\"F\",\"f\",IF($F45=\"\",\"\",IF(AND(AB45>0,Schueler23Punkte!$N6=\"\"),\"F\",IF(Schueler23Punkte!$N6=\"\",\"\",Schueler23Punkte!$N6)))))","v":""},{"$f":"IF(Schueler24Punkte!$D$1=0,\"\",IF(Schueler24Punkte!$M6=\"F\",\"f\",IF($F45=\"\",\"\",IF(AND(AC45>0,Schueler24Punkte!$N6=\"\"),\"F\",IF(Schueler24Punkte!$N6=\"\",\"\",Schueler24Punkte!$N6)))))","v":""},{"$f":"IF(Schueler25Punkte!$D$1=0,\"\",IF(Schueler25Punkte!$M6=\"F\",\"f\",IF($F45=\"\",\"\",IF(AND(AD45>0,Schueler25Punkte!$N6=\"\"),\"F\",IF(Schueler25Punkte!$N6=\"\",\"\",Schueler25Punkte!$N6)))))","v":""},{"$f":"IF(Schueler26Punkte!$D$1=0,\"\",IF(Schueler26Punkte!$M6=\"F\",\"f\",IF($F45=\"\",\"\",IF(AND(AE45>0,Schueler26Punkte!$N6=\"\"),\"F\",IF(Schueler26Punkte!$N6=\"\",\"\",Schueler26Punkte!$N6)))))","v":""},{"$f":"IF(Schueler27Punkte!$D$1=0,\"\",IF(Schueler27Punkte!$M6=\"F\",\"f\",IF($F45=\"\",\"\",IF(AND(AF45>0,Schueler27Punkte!$N6=\"\"),\"F\",IF(Schueler27Punkte!$N6=\"\",\"\",Schueler27Punkte!$N6)))))","v":""},{"$f":"IF(Schueler28Punkte!$D$1=0,\"\",IF(Schueler28Punkte!$M6=\"F\",\"f\",IF($F45=\"\",\"\",IF(AND(AG45>0,Schueler28Punkte!$N6=\"\"),\"F\",IF(Schueler28Punkte!$N6=\"\",\"\",Schueler28Punkte!$N6)))))","v":""},{"$f":"IF(Schueler29Punkte!$D$1=0,\"\",IF(Schueler29Punkte!$M6=\"F\",\"f\",IF($F45=\"\",\"\",IF(AND(AH45>0,Schueler29Punkte!$N6=\"\"),\"F\",IF(Schueler29Punkte!$N6=\"\",\"\",Schueler29Punkte!$N6)))))","v":""},{"$f":"IF(Schueler30Punkte!$D$1=0,\"\",IF(Schueler30Punkte!$M6=\"F\",\"f\",IF($F45=\"\",\"\",IF(AND(AI45>0,Schueler30Punkte!$N6=\"\"),\"F\",IF(Schueler30Punkte!$N6=\"\",\"\",Schueler30Punkte!$N6)))))","v":""},{"$error":"#DIV/0!"}]
[6,"IT6",null,null,null,2,{"$f":"IF(Schueler1Punkte!$D$1=0,\"\",IF(Schueler1Punkte!$M7=\"F\",\"f\",IF($F46=\"\",\"\",IF(AND(F46>0,Schueler1Punkte!$N7=\"\"),\"F\",IF(Schueler1Punkte!$N7=\"\",\"\",Schueler1Punkte!$N7)))))","v":""},{"$f":"IF(Schueler2Punkte!$D$1=0,\"\",IF(Schueler2Punkte!$M7=\"F\",\"f\",IF($F46=\"\",\"\",IF(AND(G46>0,Schueler2Punkte!$N7=\"\"),\"F\",IF(Schueler2Punkte!$N7=\"\",\"\",Schueler2Punkte!$N7)))))","v":""},{"$f":"IF(Schueler3Punkte!$D$1=0,\"\",IF(Schueler3Punkte!$M7=\"F\",\"f\",IF($F46=\"\",\"\",IF(AND(H46>0,Schueler3Punkte!$N7=\"\"),\"F\",IF(Schueler3Punkte!$N7=\"\",\"\",Schueler3Punkte!$N7)))))","v":""},{"$f":"IF(Schueler4Punkte!$D$1=0,\"\",IF(Schueler4Punkte!$M7=\"F\",\"f\",IF($F46=\"\",\"\",IF(AND(I46>0,Schueler4Punkte!$N7=\"\"),\"F\",IF(Schueler4Punkte!$N7=\"\",\"\",Schueler4Punkte!$N7)))))","v":""},{"$f":"IF(Schueler5Punkte!$D$1=0,\"\",IF(Schueler5Punkte!$M7=\"F\",\"f\",IF($F46=\"\",\"\",IF(AND(J46>0,Schueler5Punkte!$N7=\"\"),\"F\",IF(Schueler5Punkte!$N7=\"\",\"\",Schueler5Punkte!$N7)))))","v":""},{"$f":"IF(Schueler6Punkte!$D$1=0,\"\",IF(Schueler6Punkte!$M7=\"F\",\"f\",IF($F46=\"\",\"\",IF(AND(K46>0,Schueler6Punkte!$N7=\"\"),\"F\",IF(Schueler6Punkte!$N7=\"\",\"\",Schueler6Punkte!$N7)))))","v":""},{"$f":"IF(Schueler7Punkte!$D$1=0,\"\",IF(Schueler7Punkte!$M7=\"F\",\"f\",IF($F46=\"\",\"\",IF(AND(L46>0,Schueler7Punkte!$N7=\"\"),\"F\",IF(Schueler7Punkte!$N7=\"\",\"\",Schueler7Punkte!$N7)))))","v":""},{"$f":"IF(Schueler8Punkte!$D$1=0,\"\",IF(Schueler8Punkte!$M7=\"F\",\"f\",IF($F46=\"\",\"\",IF(AND(M46>0,Schueler8Punkte!$N7=\"\"),\"F\",IF(Schueler8Punkte!$N7=\"\",\"\",Schueler8Punkte!$N7)))))","v":""},{"$f":"IF(Schueler9Punkte!$D$1=0,\"\",IF(Schueler9Punkte!$M7=\"F\",\"f\",IF($F46=\"\",\"\",IF(AND(N46>0,Schueler9Punkte!$N7=\"\"),\"F\",IF(Schueler9Punkte!$N7=\"\",\"\",Schueler9Punkte!$N7)))))","v":""},{"$f":"IF(Schueler10Punkte!$D$1=0,\"\",IF(Schueler10Punkte!$M7=\"F\",\"f\",IF($F46=\"\",\"\",IF(AND(O46>0,Schueler10Punkte!$N7=\"\"),\"F\",IF(Schueler10Punkte!$N7=\"\",\"\",Schueler10Punkte!$N7)))))","v":""},{"$f":"IF(Schueler11Punkte!$D$1=0,\"\",IF(Schueler11Punkte!$M7=\"F\",\"f\",IF($F46=\"\",\"\",IF(AND(P46>0,Schueler11Punkte!$N7=\"\"),\"F\",IF(Schueler11Punkte!$N7=\"\",\"\",Schueler11Punkte!$N7)))))","v":""},{"$f":"IF(Schueler12Punkte!$D$1=0,\"\",IF(Schueler12Punkte!$M7=\"F\",\"f\",IF($F46=\"\",\"\",IF(AND(Q46>0,Schueler12Punkte!$N7=\"\"),\"F\",IF(Schueler12Punkte!$N7=\"\",\"\",Schueler12Punkte!$N7)))))","v":""},{"$f":"IF(Schueler13Punkte!$D$1=0,\"\",IF(Schueler13Punkte!$M7=\"F\",\"f\",IF($F46=\"\",\"\",IF(AND(R46>0,Schueler13Punkte!$N7=\"\"),\"F\",IF(Schueler13Punkte!$N7=\"\",\"\",Schueler13Punkte!$N7)))))","v":""},{"$f":"IF(Schueler14Punkte!$D$1=0,\"\",IF(Schueler14Punkte!$M7=\"F\",\"f\",IF($F46=\"\",\"\",IF(AND(S46>0,Schueler14Punkte!$N7=\"\"),\"F\",IF(Schueler14Punkte!$N7=\"\",\"\",Schueler14Punkte!$N7)))))","v":""},{"$f":"IF(Schueler15Punkte!$D$1=0,\"\",IF(Schueler15Punkte!$M7=\"F\",\"f\",IF($F46=\"\",\"\",IF(AND(T46>0,Schueler15Punkte!$N7=\"\"),\"F\",IF(Schueler15Punkte!$N7=\"\",\"\",Schueler15Punkte!$N7)))))","v":""},{"$f":"IF(Schueler16Punkte!$D$1=0,\"\",IF(Schueler16Punkte!$M7=\"F\",\"f\",IF($F46=\"\",\"\",IF(AND(U46>0,Schueler16Punkte!$N7=\"\"),\"F\",IF(Schueler16Punkte!$N7=\"\",\"\",Schueler16Punkte!$N7)))))","v":""},{"$f":"IF(Schueler17Punkte!$D$1=0,\"\",IF(Schueler17Punkte!$M7=\"F\",\"f\",IF($F46=\"\",\"\",IF(AND(V46>0,Schueler17Punkte!$N7=\"\"),\"F\",IF(Schueler17Punkte!$N7=\"\",\"\",Schueler17Punkte!$N7)))))","v":""},{"$f":"IF(Schueler18Punkte!$D$1=0,\"\",IF(Schueler18Punkte!$M7=\"F\",\"f\",IF($F46=\"\",\"\",IF(AND(W46>0,Schueler18Punkte!$N7=\"\"),\"F\",IF(Schueler18Punkte!$N7=\"\",\"\",Schueler18Punkte!$N7)))))","v":""},{"$f":"IF(Schueler19Punkte!$D$1=0,\"\",IF(Schueler19Punkte!$M7=\"F\",\"f\",IF($F46=\"\",\"\",IF(AND(X46>0,Schueler19Punkte!$N7=\"\"),\"F\",IF(Schueler19Punkte!$N7=\"\",\"\",Schueler19Punkte!$N7)))))","v":""},{"$f":"IF(Schueler20Punkte!$D$1=0,\"\",IF(Schueler20Punkte!$M7=\"F\",\"f\",IF($F46=\"\",\"\",IF(AND(Y46>0,Schueler20Punkte!$N7=\"\"),\"F\",IF(Schueler20Punkte!$N7=\"\",\"\",Schueler20Punkte!$N7)))))","v":""},{"$f":"IF(Schueler21Punkte!$D$1=0,\"\",IF(Schueler21Punkte!$M7=\"F\",\"f\",IF($F46=\"\",\"\",IF(AND(Z46>0,Schueler21Punkte!$N7=\"\"),\"F\",IF(Schueler21Punkte!$N7=\"\",\"\",Schueler21Punkte!$N7)))))","v":""},{"$f":"IF(Schueler22Punkte!$D$1=0,\"\",IF(Schueler22Punkte!$M7=\"F\",\"f\",IF($F46=\"\",\"\",IF(AND(AA46>0,Schueler22Punkte!$N7=\"\"),\"F\",IF(Schueler22Punkte!$N7=\"\",\"\",Schueler22Punkte!$N7)))))","v":""},{"$f":"IF(Schueler23Punkte!$D$1=0,\"\",IF(Schueler23Punkte!$M7=\"F\",\"f\",IF($F46=\"\",\"\",IF(AND(AB46>0,Schueler23Punkte!$N7=\"\"),\"F\",IF(Schueler23Punkte!$N7=\"\",\"\",Schueler23Punkte!$N7)))))","v":""},{"$f":"IF(Schueler24Punkte!$D$1=0,\"\",IF(Schueler24Punkte!$M7=\"F\",\"f\",IF($F46=\"\",\"\",IF(AND(AC46>0,Schueler24Punkte!$N7=\"\"),\"F\",IF(Schueler24Punkte!$N7=\"\",\"\",Schueler24Punkte!$N7)))))","v":""},{"$f":"IF(Schueler25Punkte!$D$1=0,\"\",IF(Schueler25Punkte!$M7=\"F\",\"f\",IF($F46=\"\",\"\",IF(AND(AD46>0,Schueler25Punkte!$N7=\"\"),\"F\",IF(Schueler25Punkte!$N7=\"\",\"\",Schueler25Punkte!$N7)))))","v":""},{"$f":"IF(Schueler26Punkte!$D$1=0,\"\",IF(Schueler26Punkte!$M7=\"F\",\"f\",IF($F46=\"\",\"\",IF(AND(AE46>0,Schueler26Punkte!$N7=\"\"),\"F\",IF(Schueler26Punkte!$N7=\"\",\"\",Schueler26Punkte!$N7)))))","v":""},{"$f":"IF(Schueler27Punkte!$D$1=0,\"\",IF(Schueler27Punkte!$M7=\"F\",\"f\",IF($F46=\"\",\"\",IF(AND(AF46>0,Schueler27Punkte!$N7=\"\"),\"F\",IF(Schueler27Punkte!$N7=\"\",\"\",Schueler27Punkte!$N7)))))","v":""},{"$f":"IF(Schueler28Punkte!$D$1=0,\"\",IF(Schueler28Punkte!$M7=\"F\",\"f\",IF($F46=\"\",\"\",IF(AND(AG46>0,Schueler28Punkte!$N7=\"\"),\"F\",IF(Schueler28Punkte!$N7=\"\",\"\",Schueler28Punkte!$N7)))))","v":""},{"$f":"IF(Schueler29Punkte!$D$1=0,\"\",IF(Schueler29Punkte!$M7=\"F\",\"f\",IF($F46=\"\",\"\",IF(AND(AH46>0,Schueler29Punkte!$N7=\"\"),\"F\",IF(Schueler29Punkte!$N7=\"\",\"\",Schueler29Punkte!$N7)))))","v":""},{"$f":"IF(Schueler30Punkte!$D$1=0,\"\",IF(Schueler30Punkte!$M7=\"F\",\"f\",IF($F46=\"\",\"\",IF(AND(AI46>0,Schueler30Punkte!$N7=\"\"),\"F\",IF(Schueler30Punkte!$N7=\"\",\"\",Schueler30Punkte!$N7)))))","v":""},{"$error":"#DIV/0!"}]
[]
[]
[null,null,null,"Note",null,"Punkte"]
[null,null,"Copyright Walter Kuchling","Sehr gut",null,"40 - 36",36,null,{"$f":"COUNTIF($G$3:$AJ$3,1)","v":0}]
[null,null,null,"Gut",null,"35 - 31",31,null,{"$f":"COUNTIF($G$3:$AJ$3,2)","v":0}]
[null,null,{"$f":"IF(I54>I55/2,\"Achtung Schularbeit wiederholen\",\"\")","v":""},"Befriedigend",null,"30 - 26",26,null,{"$f":"COUNTIF($G$3:$AJ$3,3)","v":0}]
[null,null,null,"Genügend",null,"25 - 20",20,null,{"$f":"COUNTIF($G$3:$AJ$3,4)","v":0}]
[null,null,null,"Nicht genügend",null,"19 - 00",null,null,{"$f":"COUNTIF($G$3:$AJ$3,5)","v":0}]
[null,null,null,{"$f":"IF(OR(AND(F58=\"\",G58=\"\"),AND(F58>\"\",G58>\"\")),\"FEHLER\",IF(AND(F58>\"\",G58=\"\"),\"Notenschlüssel nur gültig bei mindestens 12 Punkten ÜT und mindestens 8 Punkten IT\",\"\"))","v":"Notenschlüssel nur gültig bei mindestens 12 Punkten ÜT und mindestens 8 Punkten IT"},null,null,null,null,{"$f":"SUM(I50+I51+I52+I53+I54)","v":0}]
[null,null,null,"Notenschnitt",null,{"$f":"SUM(I50*1+I51*2+I52*3+I53*4+I54*5)/I55","v":{"$error":"#DIV/0!"}}]
[null,null,null,null,"Schularbeit mit Vetofunktion","Ja","Nein"]
[null,null,null,null,null,"x"]
[null,null,null,null,"Eigener Notenkommentar:","Ja","Nein"]
[null,null,null,null,null,"x"]

{"sheet":"Ausdruck","index":2,"n_rows":38,"n_cols":37,"rows_kept":38,"cut":false,"hidden":false,"merged":[[24,34,24,35],[31,0,31,1]]}
[]
[null,{"$f":"EingabeAngabe!B1","v":"Phrase"},null,{"$f":"EingabeAngabe!G1","v":""},{"$f":"EingabeAngabe!H1","v":""},{"$f":"EingabeAngabe!I1","v":""},{"$f":"EingabeAngabe!J1","v":""},{"$f":"EingabeAngabe!K1","v":""},{"$f":"EingabeAngabe!L1","v":""},{"$f":"EingabeAngabe!M1","v":""},{"$f":"EingabeAngabe!N1","v":""},{"$f":"EingabeAngabe!O1","v":""},{"$f":"EingabeAngabe!P1","v":""},{"$f":"EingabeAngabe!Q1","v":""},{"$f":"EingabeAngabe!R1","v":""},{"$f":"EingabeAngabe!S1","v":""},{"$f":"EingabeAngabe!T1","v":""},{"$f":"EingabeAngabe!U1","v":""},{"$f":"EingabeAngabe!V1","v":""},{"$f":"EingabeAngabe!W1","v":""},{"$f":"EingabeAngabe!X1","v":""},{"$f":"EingabeAngabe!Y1","v":""},{"$f":"EingabeAngabe!Z1","v":""},{"$f":"EingabeAngabe!AA1","v":""},{"$f":"EingabeAngabe!AB1","v":""},{"$f":"EingabeAngabe!AC1","v":""},{"$f":"EingabeAngabe!AD1","v":""},{"$f":"EingabeAngabe!AE1","v":""},{"$f":"EingabeAngabe!AF1","v":""},{"$f":"EingabeAngabe!AG1","v":""},{"$f":"EingabeAngabe!AH1","v":""},{"$f":"EingabeAngabe!AI1","v":""},{"$f":"EingabeAngabe!AJ1","v":""}]
[null,{"$f":"EingabeAngabe!C2","v":"GESAMT"},{"$f":"EingabeAngabe!F2","v":40},{"$f":"EingabeAngabe!G2","v":""},{"$f":"EingabeAngabe!H2","v":""},{"$f":"EingabeAngabe!I2","v":""},{"$f":"EingabeAngabe!J2","v":""},{"$f":"EingabeAngabe!K2","v":""},{"$f":"EingabeAngabe!L2","v":""},{"$f":"EingabeAngabe!M2","v":""},{"$f":"EingabeAngabe!N2","v":""},{"$f":"EingabeAngabe!O2","v":""},{"$f":"EingabeAngabe!P2","v":""},{"$f":"EingabeAngabe!Q2","v":""},{"$f":"EingabeAngabe!R2","v":""},{"$f":"EingabeAngabe!S2","v":""},{"$f":"EingabeAngabe!T2","v":""},{"$f":"EingabeAngabe!U2","v":""},{"$f":"EingabeAngabe!V2","v":""},{"$f":"EingabeAngabe!W2","v":""},{"$f":"EingabeAngabe!X2","v":""},{"$f":"EingabeAngabe!Y2","v":""},{"$f":"EingabeAngabe!Z2","v":""},{"$f":"EingabeAngabe!AA2","v":""},{"$f":"EingabeAngabe!AB2","v":""},{"$f":"EingabeAngabe!AC2","v":""},{"$f":"EingabeAngabe!AD2","v":""},{"$f":"EingabeAngabe!AE2","v":""},{"$f":"EingabeAngabe!AF2","v":""},{"$f":"EingabeAngabe!AG2","v":""},{"$f":"EingabeAngabe!AH2","v":""},{"$f":"EingabeAngabe!AI2","v":""},{"$f":"EingabeAngabe!AJ2","v":""}]
[null,{"$f":"EingabeAngabe!C3","v":"NOTE"},null,{"$f":"EingabeAngabe!G3","v":""},{"$f":"EingabeAngabe!H3","v":""},{"$f":"EingabeAngabe!I3","v":""},{"$f":"EingabeAngabe!J3","v":""},{"$f":"EingabeAngabe!K3","v":""},{"$f":"EingabeAngabe!L3","v":""},{"$f":"EingabeAngabe!M3","v":""},{"$f":"EingabeAngabe!N3","v":""},{"$f":"EingabeAngabe!O3","v":""},{"$f":"EingabeAngabe!P3","v":""},{"$f":"EingabeAngabe!Q3","v":""},{"$f":"EingabeAngabe!R3","v":""},{"$f":"EingabeAngabe!S3","v":""},{"$f":"EingabeAngabe!T3","v":""},{"$f":"EingabeAngabe!U3","v":""},{"$f":"EingabeAngabe!V3","v":""},{"$f":"EingabeAngabe!W3","v":""},{"$f":"EingabeAngabe!X3","v":""},{"$f":"EingabeAngabe!Y3","v":""},{"$f":"EingabeAngabe!Z3","v":""},{"$f":"EingabeAngabe!AA3","v":""},{"$f":"EingabeAngabe!AB3","v":""},{"$f":"EingabeAngabe!AC3","v":""},{"$f":"EingabeAngabe!AD3","v":""},{"$f":"EingabeAngabe!AE3","v":""},{"$f":"EingabeAngabe!AF3","v":""},{"$f":"EingabeAngabe!AG3","v":""},{"$f":"EingabeAngabe!AH3","v":""},{"$f":"EingabeAngabe!AI3","v":""},{"$f":"EingabeAngabe!AJ3","v":""}]
[{"$f":"EingabeAngabe!B5","v":0},{"$f":"EingabeAngabe!C5","v":"TEXTSINN"},{"$f":"EingabeAngabe!F5","v":8},{"$f":"EingabeAngabe!G5","v":""},{"$f":"EingabeAngabe!H5","v":""},{"$f":"EingabeAngabe!I5","v":""},{"$f":"EingabeAngabe!J5","v":""},{"$f":"EingabeAngabe!K5","v":""},{"$f":"EingabeAngabe!L5","v":""},{"$f":"EingabeAngabe!M5","v":""},{"$f":"EingabeAngabe!N5","v":""},{"$f":"EingabeAngabe!O5","v":""},{"$f":"EingabeAngabe!P5","v":""},{"$f":"EingabeAngabe!Q5","v":""},{"$f":"EingabeAngabe!R5","v":""},{"$f":"EingabeAngabe!S5","v":""},{"$f":"EingabeAngabe!T5","v":""},{"$f":"EingabeAngabe!U5","v":""},{"$f":"EingabeAngabe!V5","v":""},{"$f":"EingabeAngabe!W5","v":""},{"$f":"EingabeAngabe!X5","v":""},{"$f":"EingabeAngabe!Y5","v":""},{"$f":"EingabeAngabe!Z5","v":""},{"$f":"EingabeAngabe!AA5","v":""},{"$f":"EingabeAngabe!AB5","v":""},{"$f":"EingabeAngabe!AC5","v":""},{"$f":"EingabeAngabe!AD5","v":""},{"$f":"EingabeAngabe!AE5","v":""},{"$f":"EingabeAngabe!AF5","v":""},{"$f":"EingabeAngabe!AG5","v":""},{"$f":"EingabeAngabe!AH5","v":""},{"$f":"EingabeAngabe!AI5","v":""},{"$f":"EingabeAngabe!AJ5","v":""}]
[{"$f":"EingabeAngabe!B6","v":"SE1"},{"$f":"IF(EingabeAngabe!C6=\"\",\"\",EingabeAngabe!C6)","v":""},{"$f":"EingabeAngabe!F6","v":1},{"$f":"EingabeAngabe!G6","v":""},{"$f":"EingabeAngabe!H6","v":""},{"$f":"EingabeAngabe!I6","v":""},{"$f":"EingabeAngabe!J6","v":""},{"$f":"EingabeAngabe!K6","v":""},{"$f":"EingabeAngabe!L6","v":""},{"$f":"EingabeAngabe!M6","v":""},{"$f":"EingabeAngabe!N6","v":""},{"$f":"EingabeAngabe!O6","v":""},{"$f":"EingabeAngabe!P6","v":""},{"$f":"EingabeAngabe!Q6","v":""},{"$f":"EingabeAngabe!R6","v":""},{"$f":"EingabeAngabe!S6","v":""},{"$f":"EingabeAngabe!T6","v":""},{"$f":"EingabeAngabe!U6","v":""},{"$f":"EingabeAngabe!V6","v":""},{"$f":"EingabeAngabe!W6","v":""},{"$f":"EingabeAngabe!X6","v":""},{"$f":"EingabeAngabe!Y6","v":""},{"$f":"EingabeAngabe!Z6","v":""},{"$f":"EingabeAngabe!AA6","v":""},{"$f":"EingabeAngabe!AB6","v":""},{"$f":"EingabeAngabe!AC6","v":""},{"$f":"EingabeAngabe!AD6","v":""},{"$f":"EingabeAngabe!AE6","v":""},{"$f":"EingabeAngabe!AF6","v":""},{"$f":"EingabeAngabe!AG6","v":""},{"$f":"EingabeAngabe!AH6","v":""},{"$f":"EingabeAngabe!AI6","v":""},{"$f":"EingabeAngabe!AJ6","v":""}]
[{"$f":"EingabeAngabe!B8","v":"SE2"},{"$f":"IF(EingabeAngabe!C8=\"\",\"\",EingabeAngabe!C8)","v":""},{"$f":"EingabeAngabe!F8","v":1},{"$f":"EingabeAngabe!G8","v":""},{"$f":"EingabeAngabe!H8","v":""},{"$f":"EingabeAngabe!I8","v":""},{"$f":"EingabeAngabe!J8","v":""},{"$f":"EingabeAngabe!K8","v":""},{"$f":"EingabeAngabe!L8","v":""},{"$f":"EingabeAngabe!M8","v":""},{"$f":"EingabeAngabe!N8","v":""},{"$f":"EingabeAngabe!O8","v":""},{"$f":"EingabeAngabe!P8","v":""},{"$f":"EingabeAngabe!Q8","v":""},{"$f":"EingabeAngabe!R8","v":""},{"$f":"EingabeAngabe!S8","v":""},{"$f":"EingabeAngabe!T8","v":""},{"$f":"EingabeAngabe!U8","v":""},{"$f":"EingabeAngabe!V8","v":""},{"$f":"EingabeAngabe!W8","v":""},{"$f":"EingabeAngabe!X8","v":""},{"$f":"EingabeAngabe!Y8","v":""},{"$f":"EingabeAngabe!Z8","v":""},{"$f":"EingabeAngabe!AA8","v":""},{"$f":"EingabeAngabe!AB8","v":""},{"$f":"EingabeAngabe!AC8","v":""},{"$f":"EingabeAngabe!AD8","v":""},{"$f":"EingabeAngabe!AE8","v":""},{"$f":"EingabeAngabe!AF8","v":""},{"$f":"EingabeAngabe!AG8","v":""},{"$f":"EingabeAngabe!AH8","v":""},{"$f":"EingabeAngabe!AI8","v":""},{"$f":"EingabeAngabe!AJ8","v":""}]
[{"$f":"EingabeAngabe!B10","v":"SE3"},{"$f":"IF(EingabeAngabe!C10=\"\",\"\",EingabeAngabe!C10)","v":""},{"$f":"EingabeAngabe!F10","v":1},{"$f":"EingabeAngabe!G10","v":""},{"$f":"EingabeAngabe!H10","v":""},{"$f":"EingabeAngabe!I10","v":""},{"$f":"EingabeAngabe!J10","v":""},{"$f":"EingabeAngabe!K10","v":""},{"$f":"EingabeAngabe!L10","v":""},{"$f":"EingabeAngabe!M10","v":""},{"$f":"EingabeAngabe!N10","v":""},{"$f":"EingabeAngabe!O10","v":""},{"$f":"EingabeAngabe!P10","v":""},{"$f":"EingabeAngabe!Q10","v":""},{"$f":"EingabeAngabe!R10","v":""},{"$f":"EingabeAngabe!S10","v":""},{"$f":"EingabeAngabe!T10","v":""},{"$f":"EingabeAngabe!U10","v":""},{"$f":"EingabeAngabe!V10","v":""},{"$f":"EingabeAngabe!W10","v":""},{"$f":"EingabeAngabe!X10","v":""},{"$f":"EingabeAngabe!Y10","v":""},{"$f":"EingabeAngabe!Z10","v":""},{"$f":"EingabeAngabe!AA10","v":""},{"$f":"EingabeAngabe!AB10","v":""},{"$f":"EingabeAngabe!AC10","v":""},{"$f":"EingabeAngabe!AD10","v":""},{"$f":"EingabeAngabe!AE10","v":""},{"$f":"EingabeAngabe!AF10","v":""},{"$f":"EingabeAngabe!AG10","v":""},{"$f":"EingabeAngabe!AH10","v":""},{"$f":"EingabeAngabe!AI10","v":""},{"$f":"EingabeAngabe!AJ10","v":""}]
[{"$f":"EingabeAngabe!B12","v":"SE4"},{"$f":"IF(EingabeAngabe!C12=\"\",\"\",EingabeAngabe!C12)","v":""},{"$f":"EingabeAngabe!F12","v":1},{"$f":"EingabeAngabe!G12","v":""},{"$f":"EingabeAngabe!H12","v":""},{"$f":"EingabeAngabe!I12","v":""},{"$f":"EingabeAngabe!J12","v":""},{"$f":"EingabeAngabe!K12","v":""},{"$f":"EingabeAngabe!L12","v":""},{"$f":"EingabeAngabe!M12","v":""},{"$f":"EingabeAngabe!N12","v":""},{"$f":"EingabeAngabe!O12","v":""},{"$f":"EingabeAngabe!P12","v":""},{"$f":"EingabeAngabe!Q12","v":""},{"$f":"EingabeAngabe!R12","v":""},{"$f":"EingabeAngabe!S12","v":""},{"$f":"EingabeAngabe!T12","v":""},{"$f":"EingabeAngabe!U12","v":""},{"$f":"EingabeAngabe!V12","v":""},{"$f":"EingabeAngabe!W12","v":""},{"$f":"EingabeAngabe!X12","v":""},{"$f":"EingabeAngabe!Y12","v":""},{"$f":"EingabeAngabe!Z12","v":""},{"$f":"EingabeAngabe!AA12","v":""},{"$f":"EingabeAngabe!AB12","v":""},{"$f":"EingabeAngabe!AC12","v":""},{"$f":"EingabeAngabe!AD12","v":""},{"$f":"EingabeAngabe!AE12","v":""},{"$f":"EingabeAngabe!AF12","v":""},{"$f":"EingabeAngabe!AG12","v":""},{"$f":"EingabeAngabe!AH12","v":""},{"$f":"EingabeAngabe!AI12","v":""},{"$f":"EingabeAngabe!AJ12","v":""}]
[{"$f":"EingabeAngabe!B14","v":"SE5"},{"$f":"IF(EingabeAngabe!C14=\"\",\"\",EingabeAngabe!C14)","v":""},{"$f":"EingabeAngabe!F14","v":1},{"$f":"EingabeAngabe!G14","v":""},{"$f":"EingabeAngabe!H14","v":""},{"$f":"EingabeAngabe!I14","v":""},{"$f":"EingabeAngabe!J14","v":""},{"$f":"EingabeAngabe!K14","v":""},{"$f":"EingabeAngabe!L14","v":""},{"$f":"EingabeAngabe!M14","v":""},{"$f":"EingabeAngabe!N14","v":""},{"$f":"EingabeAngabe!O14","v":""},{"$f":"EingabeAngabe!P14","v":""},{"$f":"EingabeAngabe!Q14","v":""},{"$f":"EingabeAngabe!R14","v":""},{"$f":"EingabeAngabe!S14","v":""},{"$f":"EingabeAngabe!T14","v":""},{"$f":"EingabeAngabe!U14","v":""},{"$f":"EingabeAngabe!V14","v":""},{"$f":"EingabeAngabe!W14","v":""},{"$f":"EingabeAngabe!X14","v":""},{"$f":"EingabeAngabe!Y14","v":""},{"$f":"EingabeAngabe!Z14","v":""},{"$f":"EingabeAngabe!AA14","v":""},{"$f":"EingabeAngabe!AB14","v":""},{"$f":"EingabeAngabe!AC14","v":""},{"$f":"EingabeAngabe!AD14","v":""},{"$f":"EingabeAngabe!AE14","v":""},{"$f":"EingabeAngabe!AF14","v":""},{"$f":"EingabeAngabe!AG14","v":""},{"$f":"EingabeAngabe!AH14","v":""},{"$f":"EingabeAngabe!AI14","v":""},{"$f":"EingabeAngabe!AJ14","v":""}]
[{"$f":"EingabeAngabe!B16","v":"SE6"},{"$f":"IF(EingabeAngabe!C16=\"\",\"\",EingabeAngabe!C16)","v":""},{"$f":"EingabeAngabe!F16","v":1},{"$f":"EingabeAngabe!G16","v":""},{"$f":"EingabeAngabe!H16","v":""},{"$f":"EingabeAngabe!I16","v":""},{"$f":"EingabeAngabe!J16","v":""},{"$f":"EingabeAngabe!K16","v":""},{"$f":"EingabeAngabe!L16","v":""},{"$f":"EingabeAngabe!M16","v":""},{"$f":"EingabeAngabe!N16","v":""},{"$f":"EingabeAngabe!O16","v":""},{"$f":"EingabeAngabe!P16","v":""},{"$f":"EingabeAngabe!Q16","v":""},{"$f":"EingabeAngabe!R16","v":""},{"$f":"EingabeAngabe!S16","v":""},{"$f":"EingabeAngabe!T16","v":""},{"$f":"EingabeAngabe!U16","v":""},{"$f":"EingabeAngabe!V16","v":""},{"$f":"EingabeAngabe!W16","v":""},{"$f":"EingabeAngabe!X16","v":""},{"$f":"EingabeAngabe!Y16","v":""},{"$f":"EingabeAngabe!Z16","v":""},{"$f":"EingabeAngabe!AA16","v":""},{"$f":"EingabeAngabe!AB16","v":""},{"$f":"EingabeAngabe!AC16","v":""},{"$f":"EingabeAngabe!AD16","v":""},{"$f":"EingabeAngabe!AE16","v":""},{"$f":"EingabeAngabe!AF16","v":""},{"$f":"EingabeAngabe!AG16","v":""},{"$f":"EingabeAngabe!AH16","v":""},{"$f":"EingabeAngabe!AI16","v":""},{"$f":"EingabeAngabe!AJ16","v":""}]
[{"$f":"EingabeAngabe!B18","v":"SE7"},{"$f":"IF(EingabeAngabe!C18=\"\",\"\",EingabeAngabe!C18)","v":""},{"$f":"EingabeAngabe!F18","v":1},{"$f":"EingabeAngabe!G18","v":""},{"$f":"EingabeAngabe!H18","v":""},{"$f":"EingabeAngabe!I18","v":""},{"$f":"EingabeAngabe!J18","v":""},{"$f":"EingabeAngabe!K18","v":""},{"$f":"EingabeAngabe!L18","v":""},{"$f":"EingabeAngabe!M18","v":""},{"$f":"EingabeAngabe!N18","v":""},{"$f":"EingabeAngabe!O18","v":""},{"$f":"EingabeAngabe!P18","v":""},{"$f":"EingabeAngabe!Q18","v":""},{"$f":"EingabeAngabe!R18","v":""},{"$f":"EingabeAngabe!S18","v":""},{"$f":"EingabeAngabe!T18","v":""},{"$f":"EingabeAngabe!U18","v":""},{"$f":"EingabeAngabe!V18","v":""},{"$f":"EingabeAngabe!W18","v":""},{"$f":"EingabeAngabe!X18","v":""},{"$f":"EingabeAngabe!Y18","v":""},{"$f":"EingabeAngabe!Z18","v":""},{"$f":"EingabeAngabe!AA18","v":""},{"$f":"EingabeAngabe!AB18","v":""},{"$f":"EingabeAngabe!AC18","v":""},{"$f":"EingabeAngabe!AD18","v":""},{"$f":"EingabeAngabe!AE18","v":""},{"$f":"EingabeAngabe!AF18","v":""},{"$f":"EingabeAngabe!AG18","v":""},{"$f":"EingabeAngabe!AH18","v":""},{"$f":"EingabeAngabe!AI18","v":""},{"$f":"EingabeAngabe!AJ18","v":""}]
[{"$f":"EingabeAngabe!B20","v":"SE8"},{"$f":"IF(EingabeAngabe!C20=\"\",\"\",EingabeAngabe!C20)","v":""},{"$f":"EingabeAngabe!F20","v":1},{"$f":"EingabeAngabe!G20","v":""},{"$f":"EingabeAngabe!H20","v":""},{"$f":"EingabeAngabe!I20","v":""},{"$f":"EingabeAngabe!J20","v":""},{"$f":"EingabeAngabe!K20","v":""},{"$f":"EingabeAngabe!L20","v":""},{"$f":"EingabeAngabe!M20","v":""},{"$f":"EingabeAngabe!N20","v":""},{"$f":"EingabeAngabe!O20","v":""},{"$f":"EingabeAngabe!P20","v":""},{"$f":"EingabeAngabe!Q20","v":""},{"$f":"EingabeAngabe!R20","v":""},{"$f":"EingabeAngabe!S20","v":""},{"$f":"EingabeAngabe!T20","v":""},{"$f":"EingabeAngabe!U20","v":""},{"$f":"EingabeAngabe!V20","v":""},{"$f":"EingabeAngabe!W20","v":""},{"$f":"EingabeAngabe!X20","v":""},{"$f":"EingabeAngabe!Y20","v":""},{"$f":"EingabeAngabe!Z20","v":""},{"$f":"EingabeAngabe!AA20","v":""},{"$f":"EingabeAngabe!AB20","v":""},{"$f":"EingabeAngabe!AC20","v":""},{"$f":"EingabeAngabe!AD20","v":""},{"$f":"EingabeAngabe!AE20","v":""},{"$f":"EingabeAngabe!AF20","v":""},{"$f":"EingabeAngabe!AG20","v":""},{"$f":"EingabeAngabe!AH20","v":""},{"$f":"EingabeAngabe!AI20","v":""},{"$f":"EingabeAngabe!AJ20","v":""}]
[{"$f":"EingabeAngabe!B22","v":0},{"$f":"EingabeAngabe!C22","v":"LEXIK"},{"$f":"EingabeAngabe!F22","v":4},{"$f":"EingabeAngabe!G22","v":""},{"$f":"EingabeAngabe!H22","v":""},{"$f":"EingabeAngabe!I22","v":""},{"$f":"EingabeAngabe!J22","v":""},{"$f":"EingabeAngabe!K22","v":""},{"$f":"EingabeAngabe!L22","v":""},{"$f":"EingabeAngabe!M22","v":""},{"$f":"EingabeAngabe!N22","v":""},{"$f":"EingabeAngabe!O22","v":""},{"$f":"EingabeAngabe!P22","v":""},{"$f":"EingabeAngabe!Q22","v":""},{"$f":"EingabeAngabe!R22","v":""},{"$f":"EingabeAngabe!S22","v":""},{"$f":"EingabeAngabe!T22","v":""},{"$f":"EingabeAngabe!U22","v":""},{"$f":"EingabeAngabe!V22","v":""},{"$f":"EingabeAngabe!W22","v":""},{"$f":"EingabeAngabe!X22","v":""},{"$f":"EingabeAngabe!Y22","v":""},{"$f":"EingabeAngabe!Z22","v":""},{"$f":"EingabeAngabe!AA22","v":""},{"$f":"EingabeAngabe!AB22","v":""},{"$f":"EingabeAngabe!AC22","v":""},{"$f":"EingabeAngabe!AD22","v":""},{"$f":"EingabeAngabe!AE22","v":""},{"$f":"EingabeAngabe!AF22","v":""},{"$f":"EingabeAngabe!AG22","v":""},{"$f":"EingabeAngabe!AH22","v":""},{"$f":"EingabeAngabe!AI22","v":""},{"$f":"EingabeAngabe!AJ22","v":""}]
[{"$f":"EingabeAngabe!B23","v":"LE13"},{"$f":"IF(EingabeAngabe!C23=\"\",\"\",EingabeAngabe!C23)","v":""},{"$f":"EingabeAngabe!F23","v":1},{"$f":"EingabeAngabe!G23","v":""},{"$f":"EingabeAngabe!H23","v":""},{"$f":"EingabeAngabe!I23","v":""},{"$f":"EingabeAngabe!J23","v":""},{"$f":"EingabeAngabe!K23","v":""},{"$f":"EingabeAngabe!L23","v":""},{"$f":"EingabeAngabe!M23","v":""},{"$f":"EingabeAngabe!N23","v":""},{"$f":"EingabeAngabe!O23","v":""},{"$f":"EingabeAngabe!P23","v":""},{"$f":"EingabeAngabe!Q23","v":""},{"$f":"EingabeAngabe!R23","v":""},{"$f":"EingabeAngabe!S23","v":""},{"$f":"EingabeAngabe!T23","v":""},{"$f":"EingabeAngabe!U23","v":""},{"$f":"EingabeAngabe!V23","v":""},{"$f":"EingabeAngabe!W23","v":""},{"$f":"EingabeAngabe!X23","v":""},{"$f":"EingabeAngabe!Y23","v":""},{"$f":"EingabeAngabe!Z23","v":""},{"$f":"EingabeAngabe!AA23","v":""},{"$f":"EingabeAngabe!AB23","v":""},{"$f":"EingabeAngabe!AC23","v":""},{"$f":"EingabeAngabe!AD23","v":""},{"$f":"EingabeAngabe!AE23","v":""},{"$f":"EingabeAngabe!AF23","v":""},{"$f":"EingabeAngabe!AG23","v":""},{"$f":"EingabeAngabe!AH23","v":""},{"$f":"EingabeAngabe!AI23","v":""},{"$f":"EingabeAngabe!AJ23","v":""}]
[{"$f":"EingabeAngabe!B24","v":"LE14"},{"$f":"IF(EingabeAngabe!C24=\"\",\"\",EingabeAngabe!C24)","v":""},{"$f":"EingabeAngabe!F24","v":1},{"$f":"EingabeAngabe!G24","v":""},{"$f":"EingabeAngabe!H24","v":""},{"$f":"EingabeAngabe!I24","v":""},{"$f":"EingabeAngabe!J24","v":""},{"$f":"EingabeAngabe!K24","v":""},{"$f":"EingabeAngabe!L24","v":""},{"$f":"EingabeAngabe!M24","v":""},{"$f":"EingabeAngabe!N24","v":""},{"$f":"EingabeAngabe!O24","v":""},{"$f":"EingabeAngabe!P24","v":""},{"$f":"EingabeAngabe!Q24","v":""},{"$f":"EingabeAngabe!R24","v":""},{"$f":"EingabeAngabe!S24","v":""},{"$f":"EingabeAngabe!T24","v":""},{"$f":"EingabeAngabe!U24","v":""},{"$f":"EingabeAngabe!V24","v":""},{"$f":"EingabeAngabe!W24","v":""},{"$f":"EingabeAngabe!X24","v":""},{"$f":"EingabeAngabe!Y24","v":""},{"$f":"EingabeAngabe!Z24","v":""},{"$f":"EingabeAngabe!AA24","v":""},{"$f":"EingabeAngabe!AB24","v":""},{"$f":"EingabeAngabe!AC24","v":""},{"$f":"EingabeAngabe!AD24","v":""},{"$f":"EingabeAngabe!AE24","v":""},{"$f":"EingabeAngabe!AF24","v":""},{"$f":"EingabeAngabe!AG24","v":""},{"$f":"EingabeAngabe!AH24","v":""},{"$f":"EingabeAngabe!AI24","v":""},{"$f":"EingabeAngabe!AJ24","v":""}]
[{"$f":"EingabeAngabe!B25","v":"LE15"},{"$f":"IF(EingabeAngabe!C25=\"\",\"\",EingabeAngabe!C25)","v":""},{"$f":"EingabeAngabe!F25","v":1},{"$f":"EingabeAngabe!G25","v":""},{"$f":"EingabeAngabe!H25","v":""},{"$f":"EingabeAngabe!I25","v":""},{"$f":"EingabeAngabe!J25","v":""},{"$f":"EingabeAngabe!K25","v":""},{"$f":"EingabeAngabe!L25","v":""},{"$f":"EingabeAngabe!M25","v":""},{"$f":"EingabeAngabe!N25","v":""},{"$f":"EingabeAngabe!O25","v":""},{"$f":"EingabeAngabe!P25","v":""},{"$f":"EingabeAngabe!Q25","v":""},{"$f":"EingabeAngabe!R25","v":""},{"$f":"EingabeAngabe!S25","v":""},{"$f":"EingabeAngabe!T25","v":""},{"$f":"EingabeAngabe!U25","v":""},{"$f":"EingabeAngabe!V25","v":""},{"$f":"EingabeAngabe!W25","v":""},{"$f":"EingabeAngabe!X25","v":""},{"$f":"EingabeAngabe!Y25","v":""},{"$f":"EingabeAngabe!Z25","v":""},{"$f":"EingabeAngabe!AA25","v":""},{"$f":"EingabeAngabe!AB25","v":""},{"$f":"EingabeAngabe!AC25","v":""},{"$f":"EingabeAngabe!AD25","v":""},{"$f":"EingabeAngabe!AE25","v":""},{"$f":"EingabeAngabe!AF25","v":""},{"$f":"EingabeAngabe!AG25","v":""},{"$f":"EingabeAngabe!AH25","v":""},{"$f":"EingabeAngabe!AI25","v":""},{"$f":"EingabeAngabe!AJ25","v":""}]
[{"$f":"EingabeAngabe!B26","v":"LE16"},{"$f":"IF(EingabeAngabe!C26=\"\",\"\",EingabeAngabe!C26)","v":""},{"$f":"EingabeAngabe!F26","v":1},{"$f":"EingabeAngabe!G26","v":""},{"$f":"EingabeAngabe!H26","v":""},{"$f":"EingabeAngabe!I26","v":""},{"$f":"EingabeAngabe!J26","v":""},{"$f":"EingabeAngabe!K26","v":""},{"$f":"EingabeAngabe!L26","v":""},{"$f":"EingabeAngabe!M26","v":""},{"$f":"EingabeAngabe!N26","v":""},{"$f":"EingabeAngabe!O26","v":""},{"$f":"EingabeAngabe!P26","v":""},{"$f":"EingabeAngabe!Q26","v":""},{"$f":"EingabeAngabe!R26","v":""},{"$f":"EingabeAngabe!S26","v":""},{"$f":"EingabeAngabe!T26","v":""},{"$f":"EingabeAngabe!U26","v":""},{"$f":"EingabeAngabe!V26","v":""},{"$f":"EingabeAngabe!W26","v":""},{"$f":"EingabeAngabe!X26","v":""},{"$f":"EingabeAngabe!Y26","v":""},{"$f":"EingabeAngabe!Z26","v":""},{"$f":"EingabeAngabe!AA26","v":""},{"$f":"EingabeAngabe!AB26","v":""},{"$f":"EingabeAngabe!AC26","v":""},{"$f":"EingabeAngabe!AD26","v":""},{"$f":"EingabeAngabe!AE26","v":""},{"$f":"EingabeAngabe!AF26","v":""},{"$f":"EingabeAngabe!AG26","v":""},{"$f":"EingabeAngabe!AH26","v":""},{"$f":"EingabeAngabe!AI26","v":""},{"$f":"EingabeAngabe!AJ26","v":""}]
[{"$f":"EingabeAngabe!B27","v":0},{"$f":"EingabeAngabe!C27","v":"MORPHOLOGIE"},{"$f":"EingabeAngabe!F27","v":4},{"$f":"EingabeAngabe!G27","v":""},{"$f":"EingabeAngabe!H27","v":""},{"$f":"EingabeAngabe!I27","v":""},{"$f":"EingabeAngabe!J27","v":""},{"$f":"EingabeAngabe!K27","v":""},{"$f":"EingabeAngabe!L27","v":""},{"$f":"EingabeAngabe!M27","v":""},{"$f":"EingabeAngabe!N27","v":""},{"$f":"EingabeAngabe!O27","v":""},{"$f":"EingabeAngabe!P27","v":""},{"$f":"EingabeAngabe!Q27","v":""},{"$f":"EingabeAngabe!R27","v":""},{"$f":"EingabeAngabe!S27","v":""},{"$f":"EingabeAngabe!T27","v":""},{"$f":"EingabeAngabe!U27","v":""},{"$f":"EingabeAngabe!V27","v":""},{"$f":"EingabeAngabe!W27","v":""},{"$f":"EingabeAngabe!X27","v":""},{"$f":"EingabeAngabe!Y27","v":""},{"$f":"EingabeAngabe!Z27","v":""},{"$f":"EingabeAngabe!AA27","v":""},{"$f":"EingabeAngabe!AB27","v":""},{"$f":"EingabeAngabe!AC27","v":""},{"$f":"EingabeAngabe!AD27","v":""},{"$f":"EingabeAngabe!AE27","v":""},{"$f":"EingabeAngabe!AF27","v":""},{"$f":"EingabeAngabe!AG27","v":""},{"$f":"EingabeAngabe!AH27","v":""},{"$f":"EingabeAngabe!AI27","v":""},{"$f":"EingabeAngabe!AJ27","v":""},{"$f":"EingabeAngabe!D50","v":"Sehr gut"},{"$f":"EingabeAngabe!F50","v":"40 - 36"},null,{"$f":"EingabeAngabe!I50","v":0}]
[{"$f":"EingabeAngabe!B28","v":"MO19"},{"$f":"IF(EingabeAngabe!C28=\"\",\"\",EingabeAngabe!C28)","v":""},{"$f":"EingabeAngabe!F28","v":1},{"$f":"EingabeAngabe!G28","v":""},{"$f":"EingabeAngabe!H28","v":""},{"$f":"EingabeAngabe!I28","v":""},{"$f":"EingabeAngabe!J28","v":""},{"$f":"EingabeAngabe!K28","v":""},{"$f":"EingabeAngabe!L28","v":""},{"$f":"EingabeAngabe!M28","v":""},{"$f":"EingabeAngabe!N28","v":""},{"$f":"EingabeAngabe!O28","v":""},{"$f":"EingabeAngabe!P28","v":""},{"$f":"EingabeAngabe!Q28","v":""},{"$f":"EingabeAngabe!R28","v":""},{"$f":"EingabeAngabe!S28","v":""},{"$f":"EingabeAngabe!T28","v":""},{"$f":"EingabeAngabe!U28","v":""},{"$f":"EingabeAngabe!V28","v":""},{"$f":"EingabeAngabe!W28","v":""},{"$f":"EingabeAngabe!X28","v":""},{"$f":"EingabeAngabe!Y28","v":""},{"$f":"EingabeAngabe!Z28","v":""},{"$f":"EingabeAngabe!AA28","v":""},{"$f":"EingabeAngabe!AB28","v":""},{"$f":"EingabeAngabe!AC28","v":""},{"$f":"EingabeAngabe!AD28","v":""},{"$f":"EingabeAngabe!AE28","v":""},{"$f":"EingabeAngabe!AF28","v":""},{"$f":"EingabeAngabe!AG28","v":""},{"$f":"EingabeAngabe!AH28","v":""},{"$f":"EingabeAngabe!AI28","v":""},{"$f":"EingabeAngabe!AJ28","v":""},{"$f":"EingabeAngabe!D51","v":"Gut"},{"$f":"EingabeAngabe!F51","v":"35 - 31"},null,{"$f":"EingabeAngabe!I51","v":0}]
[{"$f":"EingabeAngabe!B29","v":"MO20"},{"$f":"IF(EingabeAngabe!C29=\"\",\"\",EingabeAngabe!C29)","v":""},{"$f":"EingabeAngabe!F29","v":1},{"$f":"EingabeAngabe!G29","v":""},{"$f":"EingabeAngabe!H29","v":""},{"$f":"EingabeAngabe!I29","v":""},{"$f":"EingabeAngabe!J29","v":""},{"$f":"EingabeAngabe!K29","v":""},{"$f":"EingabeAngabe!L29","v":""},{"$f":"EingabeAngabe!M29","v":""},{"$f":"EingabeAngabe!N29","v":""},{"$f":"EingabeAngabe!O29","v":""},{"$f":"EingabeAngabe!P29","v":""},{"$f":"EingabeAngabe!Q29","v":""},{"$f":"EingabeAngabe!R29","v":""},{"$f":"EingabeAngabe!S29","v":""},{"$f":"EingabeAngabe!T29","v":""},{"$f":"EingabeAngabe!U29","v":""},{"$f":"EingabeAngabe!V29","v":""},{"$f":"EingabeAngabe!W29","v":""},{"$f":"EingabeAngabe!X29","v":""},{"$f":"EingabeAngabe!Y29","v":""},{"$f":"EingabeAngabe!Z29","v":""},{"$f":"EingabeAngabe!AA29","v":""},{"$f":"EingabeAngabe!AB29","v":""},{"$f":"EingabeAngabe!AC29","v":""},{"$f":"EingabeAngabe!AD29","v":""},{"$f":"EingabeAngabe!AE29","v":""},{"$f":"EingabeAngabe!AF29","v":""},{"$f":"EingabeAngabe!AG29","v":""},{"$f":"EingabeAngabe!AH29","v":""},{"$f":"EingabeAngabe!AI29","v":""},{"$f":"EingabeAngabe!AJ29","v":""},{"$f":"EingabeAngabe!D52","v":"Befriedigend"},{"$f":"EingabeAngabe!F52","v":"30 - 26"},null,{"$f":"EingabeAngabe!I52","v":0}]
[{"$f":"EingabeAngabe!B30","v":"MO21"},{"$f":"IF(EingabeAngabe!C30=\"\",\"\",EingabeAngabe!C30)","v":""},{"$f":"EingabeAngabe!F30","v":1},{"$f":"EingabeAngabe!G30","v":""},{"$f":"EingabeAngabe!H30","v":""},{"$f":"EingabeAngabe!I30","v":""},{"$f":"EingabeAngabe!J30","v":""},{"$f":"EingabeAngabe!K30","v":""},{"$f":"EingabeAngabe!L30","v":""},{"$f":"EingabeAngabe!M30","v":""},{"$f":"EingabeAngabe!N30","v":""},{"$f":"EingabeAngabe!O30","v":""},{"$f":"EingabeAngabe!P30","v":""},{"$f":"EingabeAngabe!Q30","v":""},{"$f":"EingabeAngabe!R30","v":""},{"$f":"EingabeAngabe!S30","v":""},{"$f":"EingabeAngabe!T30","v":""},{"$f":"EingabeAngabe!U30","v":""},{"$f":"EingabeAngabe!V30","v":""},{"$f":"EingabeAngabe!W30","v":""},{"$f":"EingabeAngabe!X30","v":""},{"$f":"EingabeAngabe!Y30","v":""},{"$f":"EingabeAngabe!Z30","v":""},{"$f":"EingabeAngabe!AA30","v":""},{"$f":"EingabeAngabe!AB30","v":""},{"$f":"EingabeAngabe!AC30","v":""},{"$f":"EingabeAngabe!AD30","v":""},{"$f":"EingabeAngabe!AE30","v":""},{"$f":"EingabeAngabe!AF30","v":""},{"$f":"EingabeAngabe!AG30","v":""},{"$f":"EingabeAngabe!AH30","v":""},{"$f":"EingabeAngabe!AI30","v":""},{"$f":"EingabeAngabe!AJ30","v":""},{"$f":"EingabeAngabe!D53","v":"Genügend"},{"$f":"EingabeAngabe!F53","v":"25 - 20"},null,{"$f":"EingabeAngabe!I53","v":0}]
[{"$f":"EingabeAngabe!B31","v":"MO22"},{"$f":"IF(EingabeAngabe!C31=\"\",\"\",EingabeAngabe!C31)","v":""},{"$f":"EingabeAngabe!F31","v":1},{"$f":"EingabeAngabe!G31","v":""},{"$f":"EingabeAngabe!H31","v":""},{"$f":"EingabeAngabe!I31","v":""},{"$f":"EingabeAngabe!J31","v":""},{"$f":"EingabeAngabe!K31","v":""},{"$f":"EingabeAngabe!L31","v":""},{"$f":"EingabeAngabe!M31","v":""},{"$f":"EingabeAngabe!N31","v":""},{"$f":"EingabeAngabe!O31","v":""},{"$f":"EingabeAngabe!P31","v":""},{"$f":"EingabeAngabe!Q31","v":""},{"$f":"EingabeAngabe!R31","v":""},{"$f":"EingabeAngabe!S31","v":""},{"$f":"EingabeAngabe!T31","v":""},{"$f":"EingabeAngabe!U31","v":""},{"$f":"EingabeAngabe!V31","v":""},{"$f":"EingabeAngabe!W31","v":""},{"$f":"EingabeAngabe!X31","v":""},{"$f":"EingabeAngabe!Y31","v":""},{"$f":"EingabeAngabe!Z31","v":""},{"$f":"EingabeAngabe!AA31","v":""},{"$f":"EingabeAngabe!AB31","v":""},{"$f":"EingabeAngabe!AC31","v":""},{"$f":"EingabeAngabe!AD31","v":""},{"$f":"EingabeAngabe!AE31","v":""},{"$f":"EingabeAngabe!AF31","v":""},{"$f":"EingabeAngabe!AG31","v":""},{"$f":"EingabeAngabe!AH31","v":""},{"$f":"EingabeAngabe!AI31","v":""},{"$f":"EingabeAngabe!AJ31","v":""},{"$f":"EingabeAngabe!D54","v":"Nicht genügend"},{"$f":"EingabeAngabe!F54","v":"19 - 00"},null,{"$f":"EingabeAngabe!I54","v":0}]
[{"$f":"EingabeAngabe!B32","v":0},{"$f":"EingabeAngabe!C32","v":"SYNTAX"},{"$f":"EingabeAngabe!F32","v":4},{"$f":"EingabeAngabe!G32","v":""},{"$f":"EingabeAngabe!H32","v":""},{"$f":"EingabeAngabe!I32","v":""},{"$f":"EingabeAngabe!J32","v":""},{"$f":"EingabeAngabe!K32","v":""},{"$f":"EingabeAngabe!L32","v":""},{"$f":"EingabeAngabe!M32","v":""},{"$f":"EingabeAngabe!N32","v":""},{"$f":"EingabeAngabe!O32","v":""},{"$f":"EingabeAngabe!P32","v":""},{"$f":"EingabeAngabe!Q32","v":""},{"$f":"EingabeAngabe!R32","v":""},{"$f":"EingabeAngabe!S32","v":""},{"$f":"EingabeAngabe!T32","v":""},{"$f":"EingabeAngabe!U32","v":""},{"$f":"EingabeAngabe!V32","v":""},{"$f":"EingabeAngabe!W32","v":""},{"$f":"EingabeAngabe!X32","v":""},{"$f":"EingabeAngabe!Y32","v":""},{"$f":"EingabeAngabe!Z32","v":""},{"$f":"EingabeAngabe!AA32","v":""},{"$f":"EingabeAngabe!AB32","v":""},{"$f":"EingabeAngabe!AC32","v":""},{"$f":"EingabeAngabe!AD32","v":""},{"$f":"EingabeAngabe!AE32","v":""},{"$f":"EingabeAngabe!AF32","v":""},{"$f":"EingabeAngabe!AG32","v":""},{"$f":"EingabeAngabe!AH32","v":""},{"$f":"EingabeAngabe!AI32","v":""},{"$f":"EingabeAngabe!AJ32","v":""},null,null,null,{"$f":"EingabeAngabe!I55","v":0}]
[{"$f":"EingabeAngabe!B33","v":"SY25"},{"$f":"IF(EingabeAngabe!C33=\"\",\"\",EingabeAngabe!C33)","v":""},{"$f":"EingabeAngabe!F33","v":1},{"$f":"EingabeAngabe!G33","v":""},{"$f":"EingabeAngabe!H33","v":""},{"$f":"EingabeAngabe!I33","v":""},{"$f":"EingabeAngabe!J33","v":""},{"$f":"EingabeAngabe!K33","v":""},{"$f":"EingabeAngabe!L33","v":""},{"$f":"EingabeAngabe!M33","v":""},{"$f":"EingabeAngabe!N33","v":""},{"$f":"EingabeAngabe!O33","v":""},{"$f":"EingabeAngabe!P33","v":""},{"$f":"EingabeAngabe!Q33","v":""},{"$f":"EingabeAngabe!R33","v":""},{"$f":"EingabeAngabe!S33","v":""},{"$f":"EingabeAngabe!T33","v":""},{"$f":"EingabeAngabe!U33","v":""},{"$f":"EingabeAngabe!V33","v":""},{"$f":"EingabeAngabe!W33","v":""},{"$f":"EingabeAngabe!X33","v":""},{"$f":"EingabeAngabe!Y33","v":""},{"$f":"EingabeAngabe!Z33","v":""},{"$f":"EingabeAngabe!AA33","v":""},{"$f":"EingabeAngabe!AB33","v":""},{"$f":"EingabeAngabe!AC33","v":""},{"$f":"EingabeAngabe!AD33","v":""},{"$f":"EingabeAngabe!AE33","v":""},{"$f":"EingabeAngabe!AF33","v":""},{"$f":"EingabeAngabe!AG33","v":""},{"$f":"EingabeAngabe!AH33","v":""},{"$f":"EingabeAngabe!AI33","v":""},{"$f":"EingabeAngabe!AJ33","v":""},{"$f":"EingabeAngabe!D56","v":"Notenschnitt"},{"$f":"EingabeAngabe!F56","v":{"$error":"#DIV/0!"}}]
[{"$f":"EingabeAngabe!B34","v":"SY26"},{"$f":"IF(EingabeAngabe!C34=\"\",\"\",EingabeAngabe!C34)","v":""},{"$f":"EingabeAngabe!F34","v":1},{"$f":"EingabeAngabe!G34","v":""},{"$f":"EingabeAngabe!H34","v":""},{"$f":"EingabeAngabe!I34","v":""},{"$f":"EingabeAngabe!J34","v":""},{"$f":"EingabeAngabe!K34","v":""},{"$f":"EingabeAngabe!L34","v":""},{"$f":"EingabeAngabe!M34","v":""},{"$f":"EingabeAngabe!N34","v":""},{"$f":"EingabeAngabe!O34","v":""},{"$f":"EingabeAngabe!P34","v":""},{"$f":"EingabeAngabe!Q34","v":""},{"$f":"EingabeAngabe!R34","v":""},{"$f":"EingabeAngabe!S34","v":""},{"$f":"EingabeAngabe!T34","v":""},{"$f":"EingabeAngabe!U34","v":""},{"$f":"EingabeAngabe!V34","v":""},{"$f":"EingabeAngabe!W34","v":""},{"$f":"EingabeAngabe!X34","v":""},{"$f":"EingabeAngabe!Y34","v":""},{"$f":"EingabeAngabe!Z34","v":""},{"$f":"EingabeAngabe!AA34","v":""},{"$f":"EingabeAngabe!AB34","v":""},{"$f":"EingabeAngabe!AC34","v":""},{"$f":"EingabeAngabe!AD34","v":""},{"$f":"EingabeAngabe!AE34","v":""},{"$f":"EingabeAngabe!AF34","v":""},{"$f":"EingabeAngabe!AG34","v":""},{"$f":"EingabeAngabe!AH34","v":""},{"$f":"EingabeAngabe!AI34","v":""},{"$f":"EingabeAngabe!AJ34","v":""}]
[{"$f":"EingabeAngabe!B35","v":"SY27"},{"$f":"IF(EingabeAngabe!C35=\"\",\"\",EingabeAngabe!C35)","v":""},{"$f":"EingabeAngabe!F35","v":1},{"$f":"EingabeAngabe!G35","v":""},{"$f":"EingabeAngabe!H35","v":""},{"$f":"EingabeAngabe!I35","v":""},{"$f":"EingabeAngabe!J35","v":""},{"$f":"EingabeAngabe!K35","v":""},{"$f":"EingabeAngabe!L35","v":""},{"$f":"EingabeAngabe!M35","v":""},{"$f":"EingabeAngabe!N35","v":""},{"$f":"EingabeAngabe!O35","v":""},{"$f":"EingabeAngabe!P35","v":""},{"$f":"EingabeAngabe!Q35","v":""},{"$f":"EingabeAngabe!R35","v":""},{"$f":"EingabeAngabe!S35","v":""},{"$f":"EingabeAngabe!T35","v":""},{"$f":"EingabeAngabe!U35","v":""},{"$f":"EingabeAngabe!V35","v":""},{"$f":"EingabeAngabe!W35","v":""},{"$f":"EingabeAngabe!X35","v":""},{"$f":"EingabeAngabe!Y35","v":""},{"$f":"EingabeAngabe!Z35","v":""},{"$f":"EingabeAngabe!AA35","v":""},{"$f":"EingabeAngabe!AB35","v":""},{"$f":"EingabeAngabe!AC35","v":""},{"$f":"EingabeAngabe!AD35","v":""},{"$f":"EingabeAngabe!AE35","v":""},{"$f":"EingabeAngabe!AF35","v":""},{"$f":"EingabeAngabe!AG35","v":""},{"$f":"EingabeAngabe!AH35","v":""},{"$f":"EingabeAngabe!AI35","v":""},{"$f":"EingabeAngabe!AJ35","v":""}]
[{"$f":"EingabeAngabe!B36","v":"SY28"},{"$f":"IF(EingabeAngabe!C36=\"\",\"\",EingabeAngabe!C36)","v":""},{"$f":"EingabeAngabe!F36","v":1},{"$f":"EingabeAngabe!G36","v":""},{"$f":"EingabeAngabe!H36","v":""},{"$f":"EingabeAngabe!I36","v":""},{"$f":"EingabeAngabe!J36","v":""},{"$f":"EingabeAngabe!K36","v":""},{"$f":"EingabeAngabe!L36","v":""},{"$f":"EingabeAngabe!M36","v":""},{"$f":"EingabeAngabe!N36","v":""},{"$f":"EingabeAngabe!O36","v":""},{"$f":"EingabeAngabe!P36","v":""},{"$f":"EingabeAngabe!Q36","v":""},{"$f":"EingabeAngabe!R36","v":""},{"$f":"EingabeAngabe!S36","v":""},{"$f":"EingabeAngabe!T36","v":""},{"$f":"EingabeAngabe!U36","v":""},{"$f":"EingabeAngabe!V36","v":""},{"$f":"EingabeAngabe!W36","v":""},{"$f":"EingabeAngabe!X36","v":""},{"$f":"EingabeAngabe!Y36","v":""},{"$f":"EingabeAngabe!Z36","v":""},{"$f":"EingabeAngabe!AA36","v":""},{"$f":"EingabeAngabe!AB36","v":""},{"$f":"EingabeAngabe!AC36","v":""},{"$f":"EingabeAngabe!AD36","v":""},{"$f":"EingabeAngabe!AE36","v":""},{"$f":"EingabeAngabe!AF36","v":""},{"$f":"EingabeAngabe!AG36","v":""},{"$f":"EingabeAngabe!AH36","v":""},{"$f":"EingabeAngabe!AI36","v":""},{"$f":"EingabeAngabe!AJ36","v":""}]
[{"$f":"EingabeAngabe!B37","v":0},{"$f":"EingabeAngabe!C37","v":"SPRACHLICHE QUALITÄT IN DER ZIELSPRACHE"}]
[{"$f":"EingabeAngabe!B38","v":0},null,null,{"$f":"EingabeAngabe!G38","v":""},{"$f":"EingabeAngabe!H38","v":""},{"$f":"EingabeAngabe!I38","v":""},{"$f":"EingabeAngabe!J38","v":""},{"$f":"EingabeAngabe!K38","v":""},{"$f":"EingabeAngabe!L38","v":""},{"$f":"EingabeAngabe!M38","v":""},{"$f":"EingabeAngabe!N38","v":""},{"$f":"EingabeAngabe!O38","v":""},{"$f":"EingabeAngabe!P38","v":""},{"$f":"EingabeAngabe!Q38","v":""},{"$f":"EingabeAngabe!R38","v":""},{"$f":"EingabeAngabe!S38","v":""},{"$f":"EingabeAngabe!T38","v":""},{"$f":"EingabeAngabe!U38","v":""},{"$f":"EingabeAngabe!V38","v":""},{"$f":"EingabeAngabe!W38","v":""},{"$f":"EingabeAngabe!X38","v":""},{"$f":"EingabeAngabe!Y38","v":""},{"$f":"EingabeAngabe!Z38","v":""},{"$f":"EingabeAngabe!AA38","v":""},{"$f":"EingabeAngabe!AB38","v":""},{"$f":"EingabeAngabe!AC38","v":""},{"$f":"EingabeAngabe!AD38","v":""},{"$f":"EingabeAngabe!AE38","v":""},{"$f":"EingabeAngabe!AF38","v":""},{"$f":"EingabeAngabe!AG38","v":""},{"$f":"EingabeAngabe!AH38","v":""},{"$f":"EingabeAngabe!AI38","v":""},{"$f":"EingabeAngabe!AJ38","v":""}]
[null,"Summe",null,{"$f":"EingabeAngabe!G39","v":""},{"$f":"EingabeAngabe!H39","v":""},{"$f":"EingabeAngabe!I39","v":""},{"$f":"EingabeAngabe!J39","v":""},{"$f":"EingabeAngabe!K39","v":""},{"$f":"EingabeAngabe!L39","v":""},{"$f":"EingabeAngabe!M39","v":""},{"$f":"EingabeAngabe!N39","v":""},{"$f":"EingabeAngabe!O39","v":""},{"$f":"EingabeAngabe!P39","v":""},{"$f":"EingabeAngabe!Q39","v":""},{"$f":"EingabeAngabe!R39","v":""},{"$f":"EingabeAngabe!S39","v":""},{"$f":"EingabeAngabe!T39","v":""},{"$f":"EingabeAngabe!U39","v":""},{"$f":"EingabeAngabe!V39","v":""},{"$f":"EingabeAngabe!W39","v":""},{"$f":"EingabeAngabe!X39","v":""},{"$f":"EingabeAngabe!Y39","v":""},{"$f":"EingabeAngabe!Z39","v":""},{"$f":"EingabeAngabe!AA39","v":""},{"$f":"EingabeAngabe!AB39","v":""},{"$f":"EingabeAngabe!AC39","v":""},{"$f":"EingabeAngabe!AD39","v":""},{"$f":"EingabeAngabe!AE39","v":""},{"$f":"EingabeAngabe!AF39","v":""},{"$f":"EingabeAngabe!AG39","v":""},{"$f":"EingabeAngabe!AH39","v":""},{"$f":"EingabeAngabe!AI39","v":""},{"$f":"EingabeAngabe!AJ39","v":""}]
[{"$f":"EingabeAngabe!B40","v":0},null,{"$f":"EingabeAngabe!F40","v":16},{"$f":"EingabeAngabe!G40","v":""},{"$f":"EingabeAngabe!H40","v":""},{"$f":"EingabeAngabe!I40","v":""},{"$f":"EingabeAngabe!J40","v":""},{"$f":"EingabeAngabe!K40","v":""},{"$f":"EingabeAngabe!L40","v":""},{"$f":"EingabeAngabe!M40","v":""},{"$f":"EingabeAngabe!N40","v":""},{"$f":"EingabeAngabe!O40","v":""},{"$f":"EingabeAngabe!P40","v":""},{"$f":"EingabeAngabe!Q40","v":""},{"$f":"EingabeAngabe!R40","v":""},{"$f":"EingabeAngabe!S40","v":""},{"$f":"EingabeAngabe!T40","v":""},{"$f":"EingabeAngabe!U40","v":""},{"$f":"EingabeAngabe!V40","v":""},{"$f":"EingabeAngabe!W40","v":""},{"$f":"EingabeAngabe!X40","v":""},{"$f":"EingabeAngabe!Y40","v":""},{"$f":"EingabeAngabe!Z40","v":""},{"$f":"EingabeAngabe!AA40","v":""},{"$f":"EingabeAngabe!AB40","v":""},{"$f":"EingabeAngabe!AC40","v":""},{"$f":"EingabeAngabe!AD40","v":""},{"$f":"EingabeAngabe!AE40","v":""},{"$f":"EingabeAngabe!AF40","v":""},{"$f":"EingabeAngabe!AG40","v":""},{"$f":"EingabeAngabe!AH40","v":""},{"$f":"EingabeAngabe!AI40","v":""},{"$f":"EingabeAngabe!AJ40","v":""}]
[{"$f":"EingabeAngabe!B41","v":"IT1"},{"$f":"IF(EingabeAngabe!C41=\"\",\"\",EingabeAngabe!C41)","v":""},{"$f":"EingabeAngabe!F41","v":4},{"$f":"EingabeAngabe!G41","v":""},{"$f":"EingabeAngabe!H41","v":""},{"$f":"EingabeAngabe!I41","v":""},{"$f":"EingabeAngabe!J41","v":""},{"$f":"EingabeAngabe!K41","v":""},{"$f":"EingabeAngabe!L41","v":""},{"$f":"EingabeAngabe!M41","v":""},{"$f":"EingabeAngabe!N41","v":""},{"$f":"EingabeAngabe!O41","v":""},{"$f":"EingabeAngabe!P41","v":""},{"$f":"EingabeAngabe!Q41","v":""},{"$f":"EingabeAngabe!R41","v":""},{"$f":"EingabeAngabe!S41","v":""},{"$f":"EingabeAngabe!T41","v":""},{"$f":"EingabeAngabe!U41","v":""},{"$f":"EingabeAngabe!V41","v":""},{"$f":"EingabeAngabe!W41","v":""},{"$f":"EingabeAngabe!X41","v":""},{"$f":"EingabeAngabe!Y41","v":""},{"$f":"EingabeAngabe!Z41","v":""},{"$f":"EingabeAngabe!AA41","v":""},{"$f":"EingabeAngabe!AB41","v":""},{"$f":"EingabeAngabe!AC41","v":""},{"$f":"EingabeAngabe!AD41","v":""},{"$f":"EingabeAngabe!AE41","v":""},{"$f":"EingabeAngabe!AF41","v":""},{"$f":"EingabeAngabe!AG41","v":""},{"$f":"EingabeAngabe!AH41","v":""},{"$f":"EingabeAngabe!AI41","v":""},{"$f":"EingabeAngabe!AJ41","v":""}]
[{"$f":"EingabeAngabe!B42","v":"IT2"},{"$f":"IF(EingabeAngabe!C42=\"\",\"\",EingabeAngabe!C42)","v":""},{"$f":"EingabeAngabe!F42","v":4},{"$f":"EingabeAngabe!G42","v":""},{"$f":"EingabeAngabe!H42","v":""},{"$f":"EingabeAngabe!I42","v":""},{"$f":"EingabeAngabe!J42","v":""},{"$f":"EingabeAngabe!K42","v":""},{"$f":"EingabeAngabe!L42","v":""},{"$f":"EingabeAngabe!M42","v":""},{"$f":"EingabeAngabe!N42","v":""},{"$f":"EingabeAngabe!O42","v":""},{"$f":"EingabeAngabe!P42","v":""},{"$f":"EingabeAngabe!Q42","v":""},{"$f":"EingabeAngabe!R42","v":""},{"$f":"EingabeAngabe!S42","v":""},{"$f":"EingabeAngabe!T42","v":""},{"$f":"EingabeAngabe!U42","v":""},{"$f":"EingabeAngabe!V42","v":""},{"$f":"EingabeAngabe!W42","v":""},{"$f":"EingabeAngabe!X42","v":""},{"$f":"EingabeAngabe!Y42","v":""},{"$f":"EingabeAngabe!Z42","v":""},{"$f":"EingabeAngabe!AA42","v":""},{"$f":"EingabeAngabe!AB42","v":""},{"$f":"EingabeAngabe!AC42","v":""},{"$f":"EingabeAngabe!AD42","v":""},{"$f":"EingabeAngabe!AE42","v":""},{"$f":"EingabeAngabe!AF42","v":""},{"$f":"EingabeAngabe!AG42","v":""},{"$f":"EingabeAngabe!AH42","v":""},{"$f":"EingabeAngabe!AI42","v":""},{"$f":"EingabeAngabe!AJ42","v":""}]
[{"$f":"EingabeAngabe!B43","v":"IT3"},{"$f":"IF(EingabeAngabe!C43=\"\",\"\",EingabeAngabe!C43)","v":""},{"$f":"EingabeAngabe!F43","v":2},{"$f":"EingabeAngabe!G43","v":""},{"$f":"EingabeAngabe!H43","v":""},{"$f":"EingabeAngabe!I43","v":""},{"$f":"EingabeAngabe!J43","v":""},{"$f":"EingabeAngabe!K43","v":""},{"$f":"EingabeAngabe!L43","v":""},{"$f":"EingabeAngabe!M43","v":""},{"$f":"EingabeAngabe!N43","v":""},{"$f":"EingabeAngabe!O43","v":""},{"$f":"EingabeAngabe!P43","v":""},{"$f":"EingabeAngabe!Q43","v":""},{"$f":"EingabeAngabe!R43","v":""},{"$f":"EingabeAngabe!S43","v":""},{"$f":"EingabeAngabe!T43","v":""},{"$f":"EingabeAngabe!U43","v":""},{"$f":"EingabeAngabe!V43","v":""},{"$f":"EingabeAngabe!W43","v":""},{"$f":"EingabeAngabe!X43","v":""},{"$f":"EingabeAngabe!Y43","v":""},{"$f":"EingabeAngabe!Z43","v":""},{"$f":"EingabeAngabe!AA43","v":""},{"$f":"EingabeAngabe!AB43","v":""},{"$f":"EingabeAngabe!AC43","v":""},{"$f":"EingabeAngabe!AD43","v":""},{"$f":"EingabeAngabe!AE43","v":""},{"$f":"EingabeAngabe!AF43","v":""},{"$f":"EingabeAngabe!AG43","v":""},{"$f":"EingabeAngabe!AH43","v":""},{"$f":"EingabeAngabe!AI43","v":""},{"$f":"EingabeAngabe!AJ43","v":""}]
[{"$f":"EingabeAngabe!B44","v":"IT4"},{"$f":"IF(EingabeAngabe!C44=\"\",\"\",EingabeAngabe!C44)","v":""},{"$f":"EingabeAngabe!F44","v":2},{"$f":"EingabeAngabe!G44","v":""},{"$f":"EingabeAngabe!H44","v":""},{"$f":"EingabeAngabe!I44","v":""},{"$f":"EingabeAngabe!J44","v":""},{"$f":"EingabeAngabe!K44","v":""},{"$f":"EingabeAngabe!L44","v":""},{"$f":"EingabeAngabe!M44","v":""},{"$f":"EingabeAngabe!N44","v":""},{"$f":"EingabeAngabe!O44","v":""},{"$f":"EingabeAngabe!P44","v":""},{"$f":"EingabeAngabe!Q44","v":""},{"$f":"EingabeAngabe!R44","v":""},{"$f":"EingabeAngabe!S44","v":""},{"$f":"EingabeAngabe!T44","v":""},{"$f":"EingabeAngabe!U44","v":""},{"$f":"EingabeAngabe!V44","v":""},{"$f":"EingabeAngabe!W44","v":""},{"$f":"EingabeAngabe!X44","v":""},{"$f":"EingabeAngabe!Y44","v":""},{"$f":"EingabeAngabe!Z44","v":""},{"$f":"EingabeAngabe!AA44","v":""},{"$f":"EingabeAngabe!AB44","v":""},{"$f":"EingabeAngabe!AC44","v":""},{"$f":"EingabeAngabe!AD44","v":""},{"$f":"EingabeAngabe!AE44","v":""},{"$f":"EingabeAngabe!AF44","v":""},{"$f":"EingabeAngabe!AG44","v":""},{"$f":"EingabeAngabe!AH44","v":""},{"$f":"EingabeAngabe!AI44","v":""},{"$f":"EingabeAngabe!AJ44","v":""}]
[{"$f":"EingabeAngabe!B45","v":"IT5"},{"$f":"IF(EingabeAngabe!C45=\"\",\"\",EingabeAngabe!C45)","v":""},{"$f":"EingabeAngabe!F45","v":2},{"$f":"EingabeAngabe!G45","v":""},{"$f":"EingabeAngabe!H45","v":""},{"$f":"EingabeAngabe!I45","v":""},{"$f":"EingabeAngabe!J45","v":""},{"$f":"EingabeAngabe!K45","v":""},{"$f":"EingabeAngabe!L45","v":""},{"$f":"EingabeAngabe!M45","v":""},{"$f":"EingabeAngabe!N45","v":""},{"$f":"EingabeAngabe!O45","v":""},{"$f":"EingabeAngabe!P45","v":""},{"$f":"EingabeAngabe!Q45","v":""},{"$f":"EingabeAngabe!R45","v":""},{"$f":"EingabeAngabe!S45","v":""},{"$f":"EingabeAngabe!T45","v":""},{"$f":"EingabeAngabe!U45","v":""},{"$f":"EingabeAngabe!V45","v":""},{"$f":"EingabeAngabe!W45","v":""},{"$f":"EingabeAngabe!X45","v":""},{"$f":"EingabeAngabe!Y45","v":""},{"$f":"EingabeAngabe!Z45","v":""},{"$f":"EingabeAngabe!AA45","v":""},{"$f":"EingabeAngabe!AB45","v":""},{"$f":"EingabeAngabe!AC45","v":""},{"$f":"EingabeAngabe!AD45","v":""},{"$f":"EingabeAngabe!AE45","v":""},{"$f":"EingabeAngabe!AF45","v":""},{"$f":"EingabeAngabe!AG45","v":""},{"$f":"EingabeAngabe!AH45","v":""},{"$f":"EingabeAngabe!AI45","v":""},{"$f":"EingabeAngabe!AJ45","v":""}]
[{"$f":"EingabeAngabe!B46","v":"IT6"},{"$f":"IF(EingabeAngabe!C46=\"\",\"\",EingabeAngabe!C46)","v":""},{"$f":"EingabeAngabe!F46","v":2},{"$f":"EingabeAngabe!G46","v":""},{"$f":"EingabeAngabe!H46","v":""},{"$f":"EingabeAngabe!I46","v":""},{"$f":"EingabeAngabe!J46","v":""},{"$f":"EingabeAngabe!K46","v":""},{"$f":"EingabeAngabe!L46","v":""},{"$f":"EingabeAngabe!M46","v":""},{"$f":"EingabeAngabe!N46","v":""},{"$f":"EingabeAngabe!O46","v":""},{"$f":"EingabeAngabe!P46","v":""},{"$f":"EingabeAngabe!Q46","v":""},{"$f":"EingabeAngabe!R46","v":""},{"$f":"EingabeAngabe!S46","v":""},{"$f":"EingabeAngabe!T46","v":""},{"$f":"EingabeAngabe!U46","v":""},{"$f":"EingabeAngabe!V46","v":""},{"$f":"EingabeAngabe!W46","v":""},{"$f":"EingabeAngabe!X46","v":""},{"$f":"EingabeAngabe!Y46","v":""},{"$f":"EingabeAngabe!Z46","v":""},{"$f":"EingabeAngabe!AA46","v":""},{"$f":"EingabeAngabe!AB46","v":""},{"$f":"EingabeAngabe!AC46","v":""},{"$f":"EingabeAngabe!AD46","v":""},{"$f":"EingabeAngabe!AE46","v":""},{"$f":"EingabeAngabe!AF46","v":""},{"$f":"EingabeAngabe!AG46","v":""},{"$f":"EingabeAngabe!AH46","v":""},{"$f":"EingabeAngabe!AI46","v":""},{"$f":"EingabeAngabe!AJ46","v":""}]

{"sheet":"AusdruckHochformat","index":3,"n_rows":38,"n_cols":37,"rows_kept":38,"cut":false,"hidden":false,"merged":[[24,34,24,35],[31,0,31,1]]}
[]
[null,{"$f":"EingabeAngabe!B1","v":"Phrase"},null,{"$f":"EingabeAngabe!G1","v":""},{"$f":"EingabeAngabe!H1","v":""},{"$f":"EingabeAngabe!I1","v":""},{"$f":"EingabeAngabe!J1","v":""},{"$f":"EingabeAngabe!K1","v":""},{"$f":"EingabeAngabe!L1","v":""},{"$f":"EingabeAngabe!M1","v":""},{"$f":"EingabeAngabe!N1","v":""},{"$f":"EingabeAngabe!O1","v":""},{"$f":"EingabeAngabe!P1","v":""},{"$f":"EingabeAngabe!Q1","v":""},{"$f":"EingabeAngabe!R1","v":""},{"$f":"EingabeAngabe!S1","v":""},{"$f":"EingabeAngabe!T1","v":""},{"$f":"EingabeAngabe!U1","v":""},{"$f":"EingabeAngabe!V1","v":""},{"$f":"EingabeAngabe!W1","v":""},{"$f":"EingabeAngabe!X1","v":""},{"$f":"EingabeAngabe!Y1","v":""},{"$f":"EingabeAngabe!Z1","v":""},{"$f":"EingabeAngabe!AA1","v":""},{"$f":"EingabeAngabe!AB1","v":""},{"$f":"EingabeAngabe!AC1","v":""},{"$f":"EingabeAngabe!AD1","v":""},{"$f":"EingabeAngabe!AE1","v":""},{"$f":"EingabeAngabe!AF1","v":""},{"$f":"EingabeAngabe!AG1","v":""},{"$f":"EingabeAngabe!AH1","v":""},{"$f":"EingabeAngabe!AI1","v":""},{"$f":"EingabeAngabe!AJ1","v":""}]
[null,{"$f":"EingabeAngabe!C2","v":"GESAMT"},{"$f":"EingabeAngabe!F2","v":40},{"$f":"EingabeAngabe!G2","v":""},{"$f":"EingabeAngabe!H2","v":""},{"$f":"EingabeAngabe!I2","v":""},{"$f":"EingabeAngabe!J2","v":""},{"$f":"EingabeAngabe!K2","v":""},{"$f":"EingabeAngabe!L2","v":""},{"$f":"EingabeAngabe!M2","v":""},{"$f":"EingabeAngabe!N2","v":""},{"$f":"EingabeAngabe!O2","v":""},{"$f":"EingabeAngabe!P2","v":""},{"$f":"EingabeAngabe!Q2","v":""},{"$f":"EingabeAngabe!R2","v":""},{"$f":"EingabeAngabe!S2","v":""},{"$f":"EingabeAngabe!T2","v":""},{"$f":"EingabeAngabe!U2","v":""},{"$f":"EingabeAngabe!V2","v":""},{"$f":"EingabeAngabe!W2","v":""},{"$f":"EingabeAngabe!X2","v":""},{"$f":"EingabeAngabe!Y2","v":""},{"$f":"EingabeAngabe!Z2","v":""},{"$f":"EingabeAngabe!AA2","v":""},{"$f":"EingabeAngabe!AB2","v":""},{"$f":"EingabeAngabe!AC2","v":""},{"$f":"EingabeAngabe!AD2","v":""},{"$f":"EingabeAngabe!AE2","v":""},{"$f":"EingabeAngabe!AF2","v":""},{"$f":"EingabeAngabe!AG2","v":""},{"$f":"EingabeAngabe!AH2","v":""},{"$f":"EingabeAngabe!AI2","v":""},{"$f":"EingabeAngabe!AJ2","v":""}]
[null,{"$f":"EingabeAngabe!C3","v":"NOTE"},null,{"$f":"EingabeAngabe!G3","v":""},{"$f":"EingabeAngabe!H3","v":""},{"$f":"EingabeAngabe!I3","v":""},{"$f":"EingabeAngabe!J3","v":""},{"$f":"EingabeAngabe!K3","v":""},{"$f":"EingabeAngabe!L3","v":""},{"$f":"EingabeAngabe!M3","v":""},{"$f":"EingabeAngabe!N3","v":""},{"$f":"EingabeAngabe!O3","v":""},{"$f":"EingabeAngabe!P3","v":""},{"$f":"EingabeAngabe!Q3","v":""},{"$f":"EingabeAngabe!R3","v":""},{"$f":"EingabeAngabe!S3","v":""},{"$f":"EingabeAngabe!T3","v":""},{"$f":"EingabeAngabe!U3","v":""},{"$f":"EingabeAngabe!V3","v":""},{"$f":"EingabeAngabe!W3","v":""},{"$f":"EingabeAngabe!X3","v":""},{"$f":"EingabeAngabe!Y3","v":""},{"$f":"EingabeAngabe!Z3","v":""},{"$f":"EingabeAngabe!AA3","v":""},{"$f":"EingabeAngabe!AB3","v":""},{"$f":"EingabeAngabe!AC3","v":""},{"$f":"EingabeAngabe!AD3","v":""},{"$f":"EingabeAngabe!AE3","v":""},{"$f":"EingabeAngabe!AF3","v":""},{"$f":"EingabeAngabe!AG3","v":""},{"$f":"EingabeAngabe!AH3","v":""},{"$f":"EingabeAngabe!AI3","v":""},{"$f":"EingabeAngabe!AJ3","v":""}]
[{"$f":"EingabeAngabe!B5","v":0},{"$f":"EingabeAngabe!C5","v":"TEXTSINN"},{"$f":"EingabeAngabe!F5","v":8},{"$f":"EingabeAngabe!G5","v":""},{"$f":"EingabeAngabe!H5","v":""},{"$f":"EingabeAngabe!I5","v":""},{"$f":"EingabeAngabe!J5","v":""},{"$f":"EingabeAngabe!K5","v":""},{"$f":"EingabeAngabe!L5","v":""},{"$f":"EingabeAngabe!M5","v":""},{"$f":"EingabeAngabe!N5","v":""},{"$f":"EingabeAngabe!O5","v":""},{"$f":"EingabeAngabe!P5","v":""},{"$f":"EingabeAngabe!Q5","v":""},{"$f":"EingabeAngabe!R5","v":""},{"$f":"EingabeAngabe!S5","v":""},{"$f":"EingabeAngabe!T5","v":""},{"$f":"EingabeAngabe!U5","v":""},{"$f":"EingabeAngabe!V5","v":""},{"$f":"EingabeAngabe!W5","v":""},{"$f":"EingabeAngabe!X5","v":""},{"$f":"EingabeAngabe!Y5","v":""},{"$f":"EingabeAngabe!Z5","v":""},{"$f":"EingabeAngabe!AA5","v":""},{"$f":"EingabeAngabe!AB5","v":""},{"$f":"EingabeAngabe!AC5","v":""},{"$f":"EingabeAngabe!AD5","v":""},{"$f":"EingabeAngabe!AE5","v":""},{"$f":"EingabeAngabe!AF5","v":""},{"$f":"EingabeAngabe!AG5","v":""},{"$f":"EingabeAngabe!AH5","v":""},{"$f":"EingabeAngabe!AI5","v":""},{"$f":"EingabeAngabe!AJ5","v":""}]
[{"$f":"EingabeAngabe!B6","v":"SE1"},{"$f":"IF(EingabeAngabe!C6=\"\",\"\",EingabeAngabe!C6)","v":""},{"$f":"EingabeAngabe!F6","v":1},{"$f":"EingabeAngabe!G6","v":""},{"$f":"EingabeAngabe!H6","v":""},{"$f":"EingabeAngabe!I6","v":""},{"$f":"EingabeAngabe!J6","v":""},{"$f":"EingabeAngabe!K6","v":""},{"$f":"EingabeAngabe!L6","v":""},{"$f":"EingabeAngabe!M6","v":""},{"$f":"EingabeAngabe!N6","v":""},{"$f":"EingabeAngabe!O6","v":""},{"$f":"EingabeAngabe!P6","v":""},{"$f":"EingabeAngabe!Q6","v":""},{"$f":"EingabeAngabe!R6","v":""},{"$f":"EingabeAngabe!S6","v":""},{"$f":"EingabeAngabe!T6","v":""},{"$f":"EingabeAngabe!U6","v":""},{"$f":"EingabeAngabe!V6","v":""},{"$f":"EingabeAngabe!W6","v":""},{"$f":"EingabeAngabe!X6","v":""},{"$f":"EingabeAngabe!Y6","v":""},{"$f":"EingabeAngabe!Z6","v":""},{"$f":"EingabeAngabe!AA6","v":""},{"$f":"EingabeAngabe!AB6","v":""},{"$f":"EingabeAngabe!AC6","v":""},{"$f":"EingabeAngabe!AD6","v":""},{"$f":"EingabeAngabe!AE6","v":""},{"$f":"EingabeAngabe!AF6","v":""},{"$f":"EingabeAngabe!AG6","v":""},{"$f":"EingabeAngabe!AH6","v":""},{"$f":"EingabeAngabe!AI6","v":""},{"$f":"EingabeAngabe!AJ6","v":""}]
[{"$f":"EingabeAngabe!B8","v":"SE2"},{"$f":"IF(EingabeAngabe!C8=\"\",\"\",EingabeAngabe!C8)","v":""},{"$f":"EingabeAngabe!F8","v":1},{"$f":"EingabeAngabe!G8","v":""},{"$f":"EingabeAngabe!H8","v":""},{"$f":"EingabeAngabe!I8","v":""},{"$f":"EingabeAngabe!J8","v":""},{"$f":"EingabeAngabe!K8","v":""},{"$f":"EingabeAngabe!L8","v":""},{"$f":"EingabeAngabe!M8","v":""},{"$f":"EingabeAngabe!N8","v":""},{"$f":"EingabeAngabe!O8","v":""},{"$f":"EingabeAngabe!P8","v":""},{"$f":"EingabeAngabe!Q8","v":""},{"$f":"EingabeAngabe!R8","v":""},{"$f":"EingabeAngabe!S8","v":""},{"$f":"EingabeAngabe!T8","v":""},{"$f":"EingabeAngabe!U8","v":""},{"$f":"EingabeAngabe!V8","v":""},{"$f":"EingabeAngabe!W8","v":""},{"$f":"EingabeAngabe!X8","v":""},{"$f":"EingabeAngabe!Y8","v":""},{"$f":"EingabeAngabe!Z8","v":""},{"$f":"EingabeAngabe!AA8","v":""},{"$f":"EingabeAngabe!AB8","v":""},{"$f":"EingabeAngabe!AC8","v":""},{"$f":"EingabeAngabe!AD8","v":""},{"$f":"EingabeAngabe!AE8","v":""},{"$f":"EingabeAngabe!AF8","v":""},{"$f":"EingabeAngabe!AG8","v":""},{"$f":"EingabeAngabe!AH8","v":""},{"$f":"EingabeAngabe!AI8","v":""},{"$f":"EingabeAngabe!AJ8","v":""}]
[{"$f":"EingabeAngabe!B10","v":"SE3"},{"$f":"IF(EingabeAngabe!C10=\"\",\"\",EingabeAngabe!C10)","v":""},{"$f":"EingabeAngabe!F10","v":1},{"$f":"EingabeAngabe!G10","v":""},{"$f":"EingabeAngabe!H10","v":""},{"$f":"EingabeAngabe!I10","v":""},{"$f":"EingabeAngabe!J10","v":""},{"$f":"EingabeAngabe!K10","v":""},{"$f":"EingabeAngabe!L10","v":""},{"$f":"EingabeAngabe!M10","v":""},{"$f":"EingabeAngabe!N10","v":""},{"$f":"EingabeAngabe!O10","v":""},{"$f":"EingabeAngabe!P10","v":""},{"$f":"EingabeAngabe!Q10","v":""},{"$f":"EingabeAngabe!R10","v":""},{"$f":"EingabeAngabe!S10","v":""},{"$f":"EingabeAngabe!T10","v":""},{"$f":"EingabeAngabe!U10","v":""},{"$f":"EingabeAngabe!V10","v":""},{"$f":"EingabeAngabe!W10","v":""},{"$f":"EingabeAngabe!X10","v":""},{"$f":"EingabeAngabe!Y10","v":""},{"$f":"EingabeAngabe!Z10","v":""},{"$f":"EingabeAngabe!AA10","v":""},{"$f":"EingabeAngabe!AB10","v":""},{"$f":"EingabeAngabe!AC10","v":""},{"$f":"EingabeAngabe!AD10","v":""},{"$f":"EingabeAngabe!AE10","v":""},{"$f":"EingabeAngabe!AF10","v":""},{"$f":"EingabeAngabe!AG10","v":""},{"$f":"EingabeAngabe!AH10","v":""},{"$f":"EingabeAngabe!AI10","v":""},{"$f":"EingabeAngabe!AJ10","v":""}]
[{"$f":"EingabeAngabe!B12","v":"SE4"},{"$f":"IF(EingabeAngabe!C12=\"\",\"\",EingabeAngabe!C12)","v":""},{"$f":"EingabeAngabe!F12","v":1},{"$f":"EingabeAngabe!G12","v":""},{"$f":"EingabeAngabe!H12","v":""},{"$f":"EingabeAngabe!I12","v":""},{"$f":"EingabeAngabe!J12","v":""},{"$f":"EingabeAngabe!K12","v":""},{"$f":"EingabeAngabe!L12","v":""},{"$f":"EingabeAngabe!M12","v":""},{"$f":"EingabeAngabe!N12","v":""},{"$f":"EingabeAngabe!O12","v":""},{"$f":"EingabeAngabe!P12","v":""},{"$f":"EingabeAngabe!Q12","v":""},{"$f":"EingabeAngabe!R12","v":""},{"$f":"EingabeAngabe!S12","v":""},{"$f":"EingabeAngabe!T12","v":""},{"$f":"EingabeAngabe!U12","v":""},{"$f":"EingabeAngabe!V12","v":""},{"$f":"EingabeAngabe!W12","v":""},{"$f":"EingabeAngabe!X12","v":""},{"$f":"EingabeAngabe!Y12","v":""},{"$f":"EingabeAngabe!Z12","v":""},{"$f":"EingabeAngabe!AA12","v":""},{"$f":"EingabeAngabe!AB12","v":""},{"$f":"EingabeAngabe!AC12","v":""},{"$f":"EingabeAngabe!AD12","v":""},{"$f":"EingabeAngabe!AE12","v":""},{"$f":"EingabeAngabe!AF12","v":""},{"$f":"EingabeAngabe!AG12","v":""},{"$f":"EingabeAngabe!AH12","v":""},{"$f":"EingabeAngabe!AI12","v":""},{"$f":"EingabeAngabe!AJ12","v":""}]
[{"$f":"EingabeAngabe!B14","v":"SE5"},{"$f":"IF(EingabeAngabe!C14=\"\",\"\",EingabeAngabe!C14)","v":""},{"$f":"EingabeAngabe!F14","v":1},{"$f":"EingabeAngabe!G14","v":""},{"$f":"EingabeAngabe!H14","v":""},{"$f":"EingabeAngabe!I14","v":""},{"$f":"EingabeAngabe!J14","v":""},{"$f":"EingabeAngabe!K14","v":""},{"$f":"EingabeAngabe!L14","v":""},{"$f":"EingabeAngabe!M14","v":""},{"$f":"EingabeAngabe!N14","v":""},{"$f":"EingabeAngabe!O14","v":""},{"$f":"EingabeAngabe!P14","v":""},{"$f":"EingabeAngabe!Q14","v":""},{"$f":"EingabeAngabe!R14","v":""},{"$f":"EingabeAngabe!S14","v":""},{"$f":"EingabeAngabe!T14","v":""},{"$f":"EingabeAngabe!U14","v":""},{"$f":"EingabeAngabe!V14","v":""},{"$f":"EingabeAngabe!W14","v":""},{"$f":"EingabeAngabe!X14","v":""},{"$f":"EingabeAngabe!Y14","v":""},{"$f":"EingabeAngabe!Z14","v":""},{"$f":"EingabeAngabe!AA14","v":""},{"$f":"EingabeAngabe!AB14","v":""},{"$f":"EingabeAngabe!AC14","v":""},{"$f":"EingabeAngabe!AD14","v":""},{"$f":"EingabeAngabe!AE14","v":""},{"$f":"EingabeAngabe!AF14","v":""},{"$f":"EingabeAngabe!AG14","v":""},{"$f":"EingabeAngabe!AH14","v":""},{"$f":"EingabeAngabe!AI14","v":""},{"$f":"EingabeAngabe!AJ14","v":""}]
[{"$f":"EingabeAngabe!B16","v":"SE6"},{"$f":"IF(EingabeAngabe!C16=\"\",\"\",EingabeAngabe!C16)","v":""},{"$f":"EingabeAngabe!F16","v":1},{"$f":"EingabeAngabe!G16","v":""},{"$f":"EingabeAngabe!H16","v":""},{"$f":"EingabeAngabe!I16","v":""},{"$f":"EingabeAngabe!J16","v":""},{"$f":"EingabeAngabe!K16","v":""},{"$f":"EingabeAngabe!L16","v":""},{"$f":"EingabeAngabe!M16","v":""},{"$f":"EingabeAngabe!N16","v":""},{"$f":"EingabeAngabe!O16","v":""},{"$f":"EingabeAngabe!P16","v":""},{"$f":"EingabeAngabe!Q16","v":""},{"$f":"EingabeAngabe!R16","v":""},{"$f":"EingabeAngabe!S16","v":""},{"$f":"EingabeAngabe!T16","v":""},{"$f":"EingabeAngabe!U16","v":""},{"$f":"EingabeAngabe!V16","v":""},{"$f":"EingabeAngabe!W16","v":""},{"$f":"EingabeAngabe!X16","v":""},{"$f":"EingabeAngabe!Y16","v":""},{"$f":"EingabeAngabe!Z16","v":""},{"$f":"EingabeAngabe!AA16","v":""},{"$f":"EingabeAngabe!AB16","v":""},{"$f":"EingabeAngabe!AC16","v":""},{"$f":"EingabeAngabe!AD16","v":""},{"$f":"EingabeAngabe!AE16","v":""},{"$f":"EingabeAngabe!AF16","v":""},{"$f":"EingabeAngabe!AG16","v":""},{"$f":"EingabeAngabe!AH16","v":""},{"$f":"EingabeAngabe!AI16","v":""},{"$f":"EingabeAngabe!AJ16","v":""}]
[{"$f":"EingabeAngabe!B18","v":"SE7"},{"$f":"IF(EingabeAngabe!C18=\"\",\"\",EingabeAngabe!C18)","v":""},{"$f":"EingabeAngabe!F18","v":1},{"$f":"EingabeAngabe!G18","v":""},{"$f":"EingabeAngabe!H18","v":""},{"$f":"EingabeAngabe!I18","v":""},{"$f":"EingabeAngabe!J18","v":""},{"$f":"EingabeAngabe!K18","v":""},{"$f":"EingabeAngabe!L18","v":""},{"$f":"EingabeAngabe!M18","v":""},{"$f":"EingabeAngabe!N18","v":""},{"$f":"EingabeAngabe!O18","v":""},{"$f":"EingabeAngabe!P18","v":""},{"$f":"EingabeAngabe!Q18","v":""},{"$f":"EingabeAngabe!R18","v":""},{"$f":"EingabeAngabe!S18","v":""},{"$f":"EingabeAngabe!T18","v":""},{"$f":"EingabeAngabe!U18","v":""},{"$f":"EingabeAngabe!V18","v":""},{"$f":"EingabeAngabe!W18","v":""},{"$f":"EingabeAngabe!X18","v":""},{"$f":"EingabeAngabe!Y18","v":""},{"$f":"EingabeAngabe!Z18","v":""},{"$f":"EingabeAngabe!AA18","v":""},{"$f":"EingabeAngabe!AB18","v":""},{"$f":"EingabeAngabe!AC18","v":""},{"$f":"EingabeAngabe!AD18","v":""},{"$f":"EingabeAngabe!AE18","v":""},{"$f":"EingabeAngabe!AF18","v":""},{"$f":"EingabeAngabe!AG18","v":""},{"$f":"EingabeAngabe!AH18","v":""},{"$f":"EingabeAngabe!AI18","v":""},{"$f":"EingabeAngabe!AJ18","v":""}]
[{"$f":"EingabeAngabe!B20","v":"SE8"},{"$f":"IF(EingabeAngabe!C20=\"\",\"\",EingabeAngabe!C20)","v":""},{"$f":"EingabeAngabe!F20","v":1},{"$f":"EingabeAngabe!G20","v":""},{"$f":"EingabeAngabe!H20","v":""},{"$f":"EingabeAngabe!I20","v":""},{"$f":"EingabeAngabe!J20","v":""},{"$f":"EingabeAngabe!K20","v":""},{"$f":"EingabeAngabe!L20","v":""},{"$f":"EingabeAngabe!M20","v":""},{"$f":"EingabeAngabe!N20","v":""},{"$f":"EingabeAngabe!O20","v":""},{"$f":"EingabeAngabe!P20","v":""},{"$f":"EingabeAngabe!Q20","v":""},{"$f":"EingabeAngabe!R20","v":""},{"$f":"EingabeAngabe!S20","v":""},{"$f":"EingabeAngabe!T20","v":""},{"$f":"EingabeAngabe!U20","v":""},{"$f":"EingabeAngabe!V20","v":""},{"$f":"EingabeAngabe!W20","v":""},{"$f":"EingabeAngabe!X20","v":""},{"$f":"EingabeAngabe!Y20","v":""},{"$f":"EingabeAngabe!Z20","v":""},{"$f":"EingabeAngabe!AA20","v":""},{"$f":"EingabeAngabe!AB20","v":""},{"$f":"EingabeAngabe!AC20","v":""},{"$f":"EingabeAngabe!AD20","v":""},{"$f":"EingabeAngabe!AE20","v":""},{"$f":"EingabeAngabe!AF20","v":""},{"$f":"EingabeAngabe!AG20","v":""},{"$f":"EingabeAngabe!AH20","v":""},{"$f":"EingabeAngabe!AI20","v":""},{"$f":"EingabeAngabe!AJ20","v":""}]
[{"$f":"EingabeAngabe!B22","v":0},{"$f":"EingabeAngabe!C22","v":"LEXIK"},{"$f":"EingabeAngabe!F22","v":4},{"$f":"EingabeAngabe!G22","v":""},{"$f":"EingabeAngabe!H22","v":""},{"$f":"EingabeAngabe!I22","v":""},{"$f":"EingabeAngabe!J22","v":""},{"$f":"EingabeAngabe!K22","v":""},{"$f":"EingabeAngabe!L22","v":""},{"$f":"EingabeAngabe!M22","v":""},{"$f":"EingabeAngabe!N22","v":""},{"$f":"EingabeAngabe!O22","v":""},{"$f":"EingabeAngabe!P22","v":""},{"$f":"EingabeAngabe!Q22","v":""},{"$f":"EingabeAngabe!R22","v":""},{"$f":"EingabeAngabe!S22","v":""},{"$f":"EingabeAngabe!T22","v":""},{"$f":"EingabeAngabe!U22","v":""},{"$f":"EingabeAngabe!V22","v":""},{"$f":"EingabeAngabe!W22","v":""},{"$f":"EingabeAngabe!X22","v":""},{"$f":"EingabeAngabe!Y22","v":""},{"$f":"EingabeAngabe!Z22","v":""},{"$f":"EingabeAngabe!AA22","v":""},{"$f":"EingabeAngabe!AB22","v":""},{"$f":"EingabeAngabe!AC22","v":""},{"$f":"EingabeAngabe!AD22","v":""},{"$f":"EingabeAngabe!AE22","v":""},{"$f":"EingabeAngabe!AF22","v":""},{"$f":"EingabeAngabe!AG22","v":""},{"$f":"EingabeAngabe!AH22","v":""},{"$f":"EingabeAngabe!AI22","v":""},{"$f":"EingabeAngabe!AJ22","v":""}]
[{"$f":"EingabeAngabe!B23","v":"LE13"},{"$f":"IF(EingabeAngabe!C23=\"\",\"\",EingabeAngabe!C23)","v":""},{"$f":"EingabeAngabe!F23","v":1},{"$f":"EingabeAngabe!G23","v":""},{"$f":"EingabeAngabe!H23","v":""},{"$f":"EingabeAngabe!I23","v":""},{"$f":"EingabeAngabe!J23","v":""},{"$f":"EingabeAngabe!K23","v":""},{"$f":"EingabeAngabe!L23","v":""},{"$f":"EingabeAngabe!M23","v":""},{"$f":"EingabeAngabe!N23","v":""},{"$f":"EingabeAngabe!O23","v":""},{"$f":"EingabeAngabe!P23","v":""},{"$f":"EingabeAngabe!Q23","v":""},{"$f":"EingabeAngabe!R23","v":""},{"$f":"EingabeAngabe!S23","v":""},{"$f":"EingabeAngabe!T23","v":""},{"$f":"EingabeAngabe!U23","v":""},{"$f":"EingabeAngabe!V23","v":""},{"$f":"EingabeAngabe!W23","v":""},{"$f":"EingabeAngabe!X23","v":""},{"$f":"EingabeAngabe!Y23","v":""},{"$f":"EingabeAngabe!Z23","v":""},{"$f":"EingabeAngabe!AA23","v":""},{"$f":"EingabeAngabe!AB23","v":""},{"$f":"EingabeAngabe!AC23","v":""},{"$f":"EingabeAngabe!AD23","v":""},{"$f":"EingabeAngabe!AE23","v":""},{"$f":"EingabeAngabe!AF23","v":""},{"$f":"EingabeAngabe!AG23","v":""},{"$f":"EingabeAngabe!AH23","v":""},{"$f":"EingabeAngabe!AI23","v":""},{"$f":"EingabeAngabe!AJ23","v":""}]
[{"$f":"EingabeAngabe!B24","v":"LE14"},{"$f":"IF(EingabeAngabe!C24=\"\",\"\",EingabeAngabe!C24)","v":""},{"$f":"EingabeAngabe!F24","v":1},{"$f":"EingabeAngabe!G24","v":""},{"$f":"EingabeAngabe!H24","v":""},{"$f":"EingabeAngabe!I24","v":""},{"$f":"EingabeAngabe!J24","v":""},{"$f":"EingabeAngabe!K24","v":""},{"$f":"EingabeAngabe!L24","v":""},{"$f":"EingabeAngabe!M24","v":""},{"$f":"EingabeAngabe!N24","v":""},{"$f":"EingabeAngabe!O24","v":""},{"$f":"EingabeAngabe!P24","v":""},{"$f":"EingabeAngabe!Q24","v":""},{"$f":"EingabeAngabe!R24","v":""},{"$f":"EingabeAngabe!S24","v":""},{"$f":"EingabeAngabe!T24","v":""},{"$f":"EingabeAngabe!U24","v":""},{"$f":"EingabeAngabe!V24","v":""},{"$f":"EingabeAngabe!W24","v":""},{"$f":"EingabeAngabe!X24","v":""},{"$f":"EingabeAngabe!Y24","v":""},{"$f":"EingabeAngabe!Z24","v":""},{"$f":"EingabeAngabe!AA24","v":""},{"$f":"EingabeAngabe!AB24","v":""},{"$f":"EingabeAngabe!AC24","v":""},{"$f":"EingabeAngabe!AD24","v":""},{"$f":"EingabeAngabe!AE24","v":""},{"$f":"EingabeAngabe!AF24","v":""},{"$f":"EingabeAngabe!AG24","v":""},{"$f":"EingabeAngabe!AH24","v":""},{"$f":"EingabeAngabe!AI24","v":""},{"$f":"EingabeAngabe!AJ24","v":""}]
[{"$f":"EingabeAngabe!B25","v":"LE15"},{"$f":"IF(EingabeAngabe!C25=\"\",\"\",EingabeAngabe!C25)","v":""},{"$f":"EingabeAngabe!F25","v":1},{"$f":"EingabeAngabe!G25","v":""},{"$f":"EingabeAngabe!H25","v":""},{"$f":"EingabeAngabe!I25","v":""},{"$f":"EingabeAngabe!J25","v":""},{"$f":"EingabeAngabe!K25","v":""},{"$f":"EingabeAngabe!L25","v":""},{"$f":"EingabeAngabe!M25","v":""},{"$f":"EingabeAngabe!N25","v":""},{"$f":"EingabeAngabe!O25","v":""},{"$f":"EingabeAngabe!P25","v":""},{"$f":"EingabeAngabe!Q25","v":""},{"$f":"EingabeAngabe!R25","v":""},{"$f":"EingabeAngabe!S25","v":""},{"$f":"EingabeAngabe!T25","v":""},{"$f":"EingabeAngabe!U25","v":""},{"$f":"EingabeAngabe!V25","v":""},{"$f":"EingabeAngabe!W25","v":""},{"$f":"EingabeAngabe!X25","v":""},{"$f":"EingabeAngabe!Y25","v":""},{"$f":"EingabeAngabe!Z25","v":""},{"$f":"EingabeAngabe!AA25","v":""},{"$f":"EingabeAngabe!AB25","v":""},{"$f":"EingabeAngabe!AC25","v":""},{"$f":"EingabeAngabe!AD25","v":""},{"$f":"EingabeAngabe!AE25","v":""},{"$f":"EingabeAngabe!AF25","v":""},{"$f":"EingabeAngabe!AG25","v":""},{"$f":"EingabeAngabe!AH25","v":""},{"$f":"EingabeAngabe!AI25","v":""},{"$f":"EingabeAngabe!AJ25","v":""}]
[{"$f":"EingabeAngabe!B26","v":"LE16"},{"$f":"IF(EingabeAngabe!C26=\"\",\"\",EingabeAngabe!C26)","v":""},{"$f":"EingabeAngabe!F26","v":1},{"$f":"EingabeAngabe!G26","v":""},{"$f":"EingabeAngabe!H26","v":""},{"$f":"EingabeAngabe!I26","v":""},{"$f":"EingabeAngabe!J26","v":""},{"$f":"EingabeAngabe!K26","v":""},{"$f":"EingabeAngabe!L26","v":""},{"$f":"EingabeAngabe!M26","v":""},{"$f":"EingabeAngabe!N26","v":""},{"$f":"EingabeAngabe!O26","v":""},{"$f":"EingabeAngabe!P26","v":""},{"$f":"EingabeAngabe!Q26","v":""},{"$f":"EingabeAngabe!R26","v":""},{"$f":"EingabeAngabe!S26","v":""},{"$f":"EingabeAngabe!T26","v":""},{"$f":"EingabeAngabe!U26","v":""},{"$f":"EingabeAngabe!V26","v":""},{"$f":"EingabeAngabe!W26","v":""},{"$f":"EingabeAngabe!X26","v":""},{"$f":"EingabeAngabe!Y26","v":""},{"$f":"EingabeAngabe!Z26","v":""},{"$f":"EingabeAngabe!AA26","v":""},{"$f":"EingabeAngabe!AB26","v":""},{"$f":"EingabeAngabe!AC26","v":""},{"$f":"EingabeAngabe!AD26","v":""},{"$f":"EingabeAngabe!AE26","v":""},{"$f":"EingabeAngabe!AF26","v":""},{"$f":"EingabeAngabe!AG26","v":""},{"$f":"EingabeAngabe!AH26","v":""},{"$f":"EingabeAngabe!AI26","v":""},{"$f":"EingabeAngabe!AJ26","v":""}]
[{"$f":"EingabeAngabe!B27","v":0},{"$f":"EingabeAngabe!C27","v":"MORPHOLOGIE"},{"$f":"EingabeAngabe!F27","v":4},{"$f":"EingabeAngabe!G27","v":""},{"$f":"EingabeAngabe!H27","v":""},{"$f":"EingabeAngabe!I27","v":""},{"$f":"EingabeAngabe!J27","v":""},{"$f":"EingabeAngabe!K27","v":""},{"$f":"EingabeAngabe!L27","v":""},{"$f":"EingabeAngabe!M27","v":""},{"$f":"EingabeAngabe!N27","v":""},{"$f":"EingabeAngabe!O27","v":""},{"$f":"EingabeAngabe!P27","v":""},{"$f":"EingabeAngabe!Q27","v":""},{"$f":"EingabeAngabe!R27","v":""},{"$f":"EingabeAngabe!S27","v":""},{"$f":"EingabeAngabe!T27","v":""},{"$f":"EingabeAngabe!U27","v":""},{"$f":"EingabeAngabe!V27","v":""},{"$f":"EingabeAngabe!W27","v":""},{"$f":"EingabeAngabe!X27","v":""},{"$f":"EingabeAngabe!Y27","v":""},{"$f":"EingabeAngabe!Z27","v":""},{"$f":"EingabeAngabe!AA27","v":""},{"$f":"EingabeAngabe!AB27","v":""},{"$f":"EingabeAngabe!AC27","v":""},{"$f":"EingabeAngabe!AD27","v":""},{"$f":"EingabeAngabe!AE27","v":""},{"$f":"EingabeAngabe!AF27","v":""},{"$f":"EingabeAngabe!AG27","v":""},{"$f":"EingabeAngabe!AH27","v":""},{"$f":"EingabeAngabe!AI27","v":""},{"$f":"EingabeAngabe!AJ27","v":""},{"$f":"EingabeAngabe!D50","v":"Sehr gut"},{"$f":"EingabeAngabe!F50","v":"40 - 36"},null,{"$f":"EingabeAngabe!I50","v":0}]
[{"$f":"EingabeAngabe!B28","v":"MO19"},{"$f":"IF(EingabeAngabe!C28=\"\",\"\",EingabeAngabe!C28)","v":""},{"$f":"EingabeAngabe!F28","v":1},{"$f":"EingabeAngabe!G28","v":""},{"$f":"EingabeAngabe!H28","v":""},{"$f":"EingabeAngabe!I28","v":""},{"$f":"EingabeAngabe!J28","v":""},{"$f":"EingabeAngabe!K28","v":""},{"$f":"EingabeAngabe!L28","v":""},{"$f":"EingabeAngabe!M28","v":""},{"$f":"EingabeAngabe!N28","v":""},{"$f":"EingabeAngabe!O28","v":""},{"$f":"EingabeAngabe!P28","v":""},{"$f":"EingabeAngabe!Q28","v":""},{"$f":"EingabeAngabe!R28","v":""},{"$f":"EingabeAngabe!S28","v":""},{"$f":"EingabeAngabe!T28","v":""},{"$f":"EingabeAngabe!U28","v":""},{"$f":"EingabeAngabe!V28","v":""},{"$f":"EingabeAngabe!W28","v":""},{"$f":"EingabeAngabe!X28","v":""},{"$f":"EingabeAngabe!Y28","v":""},{"$f":"EingabeAngabe!Z28","v":""},{"$f":"EingabeAngabe!AA28","v":""},{"$f":"EingabeAngabe!AB28","v":""},{"$f":"EingabeAngabe!AC28","v":""},{"$f":"EingabeAngabe!AD28","v":""},{"$f":"EingabeAngabe!AE28","v":""},{"$f":"EingabeAngabe!AF28","v":""},{"$f":"EingabeAngabe!AG28","v":""},{"$f":"EingabeAngabe!AH28","v":""},{"$f":"EingabeAngabe!AI28","v":""},{"$f":"EingabeAngabe!AJ28","v":""},{"$f":"EingabeAngabe!D51","v":"Gut"},{"$f":"EingabeAngabe!F51","v":"35 - 31"},null,{"$f":"EingabeAngabe!I51","v":0}]
[{"$f":"EingabeAngabe!B29","v":"MO20"},{"$f":"IF(EingabeAngabe!C29=\"\",\"\",EingabeAngabe!C29)","v":""},{"$f":"EingabeAngabe!F29","v":1},{"$f":"EingabeAngabe!G29","v":""},{"$f":"EingabeAngabe!H29","v":""},{"$f":"EingabeAngabe!I29","v":""},{"$f":"EingabeAngabe!J29","v":""},{"$f":"EingabeAngabe!K29","v":""},{"$f":"EingabeAngabe!L29","v":""},{"$f":"EingabeAngabe!M29","v":""},{"$f":"EingabeAngabe!N29","v":""},{"$f":"EingabeAngabe!O29","v":""},{"$f":"EingabeAngabe!P29","v":""},{"$f":"EingabeAngabe!Q29","v":""},{"$f":"EingabeAngabe!R29","v":""},{"$f":"EingabeAngabe!S29","v":""},{"$f":"EingabeAngabe!T29","v":""},{"$f":"EingabeAngabe!U29","v":""},{"$f":"EingabeAngabe!V29","v":""},{"$f":"EingabeAngabe!W29","v":""},{"$f":"EingabeAngabe!X29","v":""},{"$f":"EingabeAngabe!Y29","v":""},{"$f":"EingabeAngabe!Z29","v":""},{"$f":"EingabeAngabe!AA29","v":""},{"$f":"EingabeAngabe!AB29","v":""},{"$f":"EingabeAngabe!AC29","v":""},{"$f":"EingabeAngabe!AD29","v":""},{"$f":"EingabeAngabe!AE29","v":""},{"$f":"EingabeAngabe!AF29","v":""},{"$f":"EingabeAngabe!AG29","v":""},{"$f":"EingabeAngabe!AH29","v":""},{"$f":"EingabeAngabe!AI29","v":""},{"$f":"EingabeAngabe!AJ29","v":""},{"$f":"EingabeAngabe!D52","v":"Befriedigend"},{"$f":"EingabeAngabe!F52","v":"30 - 26"},null,{"$f":"EingabeAngabe!I52","v":0}]
[{"$f":"EingabeAngabe!B30","v":"MO21"},{"$f":"IF(EingabeAngabe!C30=\"\",\"\",EingabeAngabe!C30)","v":""},{"$f":"EingabeAngabe!F30","v":1},{"$f":"EingabeAngabe!G30","v":""},{"$f":"EingabeAngabe!H30","v":""},{"$f":"EingabeAngabe!I30","v":""},{"$f":"EingabeAngabe!J30","v":""},{"$f":"EingabeAngabe!K30","v":""},{"$f":"EingabeAngabe!L30","v":""},{"$f":"EingabeAngabe!M30","v":""},{"$f":"EingabeAngabe!N30","v":""},{"$f":"EingabeAngabe!O30","v":""},{"$f":"EingabeAngabe!P30","v":""},{"$f":"EingabeAngabe!Q30","v":""},{"$f":"EingabeAngabe!R30","v":""},{"$f":"EingabeAngabe!S30","v":""},{"$f":"EingabeAngabe!T30","v":""},{"$f":"EingabeAngabe!U30","v":""},{"$f":"EingabeAngabe!V30","v":""},{"$f":"EingabeAngabe!W30","v":""},{"$f":"EingabeAngabe!X30","v":""},{"$f":"EingabeAngabe!Y30","v":""},{"$f":"EingabeAngabe!Z30","v":""},{"$f":"EingabeAngabe!AA30","v":""},{"$f":"EingabeAngabe!AB30","v":""},{"$f":"EingabeAngabe!AC30","v":""},{"$f":"EingabeAngabe!AD30","v":""},{"$f":"EingabeAngabe!AE30","v":""},{"$f":"EingabeAngabe!AF30","v":""},{"$f":"EingabeAngabe!AG30","v":""},{"$f":"EingabeAngabe!AH30","v":""},{"$f":"EingabeAngabe!AI30","v":""},{"$f":"EingabeAngabe!AJ30","v":""},{"$f":"EingabeAngabe!D53","v":"Genügend"},{"$f":"EingabeAngabe!F53","v":"25 - 20"},null,{"$f":"EingabeAngabe!I53","v":0}]
[{"$f":"EingabeAngabe!B31","v":"MO22"},{"$f":"IF(EingabeAngabe!C31=\"\",\"\",EingabeAngabe!C31)","v":""},{"$f":"EingabeAngabe!F31","v":1},{"$f":"EingabeAngabe!G31","v":""},{"$f":"EingabeAngabe!H31","v":""},{"$f":"EingabeAngabe!I31","v":""},{"$f":"EingabeAngabe!J31","v":""},{"$f":"EingabeAngabe!K31","v":""},{"$f":"EingabeAngabe!L31","v":""},{"$f":"EingabeAngabe!M31","v":""},{"$f":"EingabeAngabe!N31","v":""},{"$f":"EingabeAngabe!O31","v":""},{"$f":"EingabeAngabe!P31","v":""},{"$f":"EingabeAngabe!Q31","v":""},{"$f":"EingabeAngabe!R31","v":""},{"$f":"EingabeAngabe!S31","v":""},{"$f":"EingabeAngabe!T31","v":""},{"$f":"EingabeAngabe!U31","v":""},{"$f":"EingabeAngabe!V31","v":""},{"$f":"EingabeAngabe!W31","v":""},{"$f":"EingabeAngabe!X31","v":""},{"$f":"EingabeAngabe!Y31","v":""},{"$f":"EingabeAngabe!Z31","v":""},{"$f":"EingabeAngabe!AA31","v":""},{"$f":"EingabeAngabe!AB31","v":""},{"$f":"EingabeAngabe!AC31","v":""},{"$f":"EingabeAngabe!AD31","v":""},{"$f":"EingabeAngabe!AE31","v":""},{"$f":"EingabeAngabe!AF31","v":""},{"$f":"EingabeAngabe!AG31","v":""},{"$f":"EingabeAngabe!AH31","v":""},{"$f":"EingabeAngabe!AI31","v":""},{"$f":"EingabeAngabe!AJ31","v":""},{"$f":"EingabeAngabe!D54","v":"Nicht genügend"},{"$f":"EingabeAngabe!F54","v":"19 - 00"},null,{"$f":"EingabeAngabe!I54","v":0}]
[{"$f":"EingabeAngabe!B32","v":0},{"$f":"EingabeAngabe!C32","v":"SYNTAX"},{"$f":"EingabeAngabe!F32","v":4},{"$f":"EingabeAngabe!G32","v":""},{"$f":"EingabeAngabe!H32","v":""},{"$f":"EingabeAngabe!I32","v":""},{"$f":"EingabeAngabe!J32","v":""},{"$f":"EingabeAngabe!K32","v":""},{"$f":"EingabeAngabe!L32","v":""},{"$f":"EingabeAngabe!M32","v":""},{"$f":"EingabeAngabe!N32","v":""},{"$f":"EingabeAngabe!O32","v":""},{"$f":"EingabeAngabe!P32","v":""},{"$f":"EingabeAngabe!Q32","v":""},{"$f":"EingabeAngabe!R32","v":""},{"$f":"EingabeAngabe!S32","v":""},{"$f":"EingabeAngabe!T32","v":""},{"$f":"EingabeAngabe!U32","v":""},{"$f":"EingabeAngabe!V32","v":""},{"$f":"EingabeAngabe!W32","v":""},{"$f":"EingabeAngabe!X32","v":""},{"$f":"EingabeAngabe!Y32","v":""},{"$f":"EingabeAngabe!Z32","v":""},{"$f":"EingabeAngabe!AA32","v":""},{"$f":"EingabeAngabe!AB32","v":""},{"$f":"EingabeAngabe!AC32","v":""},{"$f":"EingabeAngabe!AD32","v":""},{"$f":"EingabeAngabe!AE32","v":""},{"$f":"EingabeAngabe!AF32","v":""},{"$f":"EingabeAngabe!AG32","v":""},{"$f":"EingabeAngabe!AH32","v":""},{"$f":"EingabeAngabe!AI32","v":""},{"$f":"EingabeAngabe!AJ32","v":""},null,null,null,{"$f":"EingabeAngabe!I55","v":0}]
[{"$f":"EingabeAngabe!B33","v":"SY25"},{"$f":"IF(EingabeAngabe!C33=\"\",\"\",EingabeAngabe!C33)","v":""},{"$f":"EingabeAngabe!F33","v":1},{"$f":"EingabeAngabe!G33","v":""},{"$f":"EingabeAngabe!H33","v":""},{"$f":"EingabeAngabe!I33","v":""},{"$f":"EingabeAngabe!J33","v":""},{"$f":"EingabeAngabe!K33","v":""},{"$f":"EingabeAngabe!L33","v":""},{"$f":"EingabeAngabe!M33","v":""},{"$f":"EingabeAngabe!N33","v":""},{"$f":"EingabeAngabe!O33","v":""},{"$f":"EingabeAngabe!P33","v":""},{"$f":"EingabeAngabe!Q33","v":""},{"$f":"EingabeAngabe!R33","v":""},{"$f":"EingabeAngabe!S33","v":""},{"$f":"EingabeAngabe!T33","v":""},{"$f":"EingabeAngabe!U33","v":""},{"$f":"EingabeAngabe!V33","v":""},{"$f":"EingabeAngabe!W33","v":""},{"$f":"EingabeAngabe!X33","v":""},{"$f":"EingabeAngabe!Y33","v":""},{"$f":"EingabeAngabe!Z33","v":""},{"$f":"EingabeAngabe!AA33","v":""},{"$f":"EingabeAngabe!AB33","v":""},{"$f":"EingabeAngabe!AC33","v":""},{"$f":"EingabeAngabe!AD33","v":""},{"$f":"EingabeAngabe!AE33","v":""},{"$f":"EingabeAngabe!AF33","v":""},{"$f":"EingabeAngabe!AG33","v":""},{"$f":"EingabeAngabe!AH33","v":""},{"$f":"EingabeAngabe!AI33","v":""},{"$f":"EingabeAngabe!AJ33","v":""},{"$f":"EingabeAngabe!D56","v":"Notenschnitt"},{"$f":"EingabeAngabe!F56","v":{"$error":"#DIV/0!"}}]
[{"$f":"EingabeAngabe!B34","v":"SY26"},{"$f":"IF(EingabeAngabe!C34=\"\",\"\",EingabeAngabe!C34)","v":""},{"$f":"EingabeAngabe!F34","v":1},{"$f":"EingabeAngabe!G34","v":""},{"$f":"EingabeAngabe!H34","v":""},{"$f":"EingabeAngabe!I34","v":""},{"$f":"EingabeAngabe!J34","v":""},{"$f":"EingabeAngabe!K34","v":""},{"$f":"EingabeAngabe!L34","v":""},{"$f":"EingabeAngabe!M34","v":""},{"$f":"EingabeAngabe!N34","v":""},{"$f":"EingabeAngabe!O34","v":""},{"$f":"EingabeAngabe!P34","v":""},{"$f":"EingabeAngabe!Q34","v":""},{"$f":"EingabeAngabe!R34","v":""},{"$f":"EingabeAngabe!S34","v":""},{"$f":"EingabeAngabe!T34","v":""},{"$f":"EingabeAngabe!U34","v":""},{"$f":"EingabeAngabe!V34","v":""},{"$f":"EingabeAngabe!W34","v":""},{"$f":"EingabeAngabe!X34","v":""},{"$f":"EingabeAngabe!Y34","v":""},{"$f":"EingabeAngabe!Z34","v":""},{"$f":"EingabeAngabe!AA34","v":""},{"$f":"EingabeAngabe!AB34","v":""},{"$f":"EingabeAngabe!AC34","v":""},{"$f":"EingabeAngabe!AD34","v":""},{"$f":"EingabeAngabe!AE34","v":""},{"$f":"EingabeAngabe!AF34","v":""},{"$f":"EingabeAngabe!AG34","v":""},{"$f":"EingabeAngabe!AH34","v":""},{"$f":"EingabeAngabe!AI34","v":""},{"$f":"EingabeAngabe!AJ34","v":""}]
[{"$f":"EingabeAngabe!B35","v":"SY27"},{"$f":"IF(EingabeAngabe!C35=\"\",\"\",EingabeAngabe!C35)","v":""},{"$f":"EingabeAngabe!F35","v":1},{"$f":"EingabeAngabe!G35","v":""},{"$f":"EingabeAngabe!H35","v":""},{"$f":"EingabeAngabe!I35","v":""},{"$f":"EingabeAngabe!J35","v":""},{"$f":"EingabeAngabe!K35","v":""},{"$f":"EingabeAngabe!L35","v":""},{"$f":"EingabeAngabe!M35","v":""},{"$f":"EingabeAngabe!N35","v":""},{"$f":"EingabeAngabe!O35","v":""},{"$f":"EingabeAngabe!P35","v":""},{"$f":"EingabeAngabe!Q35","v":""},{"$f":"EingabeAngabe!R35","v":""},{"$f":"EingabeAngabe!S35","v":""},{"$f":"EingabeAngabe!T35","v":""},{"$f":"EingabeAngabe!U35","v":""},{"$f":"EingabeAngabe!V35","v":""},{"$f":"EingabeAngabe!W35","v":""},{"$f":"EingabeAngabe!X35","v":""},{"$f":"EingabeAngabe!Y35","v":""},{"$f":"EingabeAngabe!Z35","v":""},{"$f":"EingabeAngabe!AA35","v":""},{"$f":"EingabeAngabe!AB35","v":""},{"$f":"EingabeAngabe!AC35","v":""},{"$f":"EingabeAngabe!AD35","v":""},{"$f":"EingabeAngabe!AE35","v":""},{"$f":"EingabeAngabe!AF35","v":""},{"$f":"EingabeAngabe!AG35","v":""},{"$f":"EingabeAngabe!AH35","v":""},{"$f":"EingabeAngabe!AI35","v":""},{"$f":"EingabeAngabe!AJ35","v":""}]
[{"$f":"EingabeAngabe!B36","v":"SY28"},{"$f":"IF(EingabeAngabe!C36=\"\",\"\",EingabeAngabe!C36)","v":""},{"$f":"EingabeAngabe!F36","v":1},{"$f":"EingabeAngabe!G36","v":""},{"$f":"EingabeAngabe!H36","v":""},{"$f":"EingabeAngabe!I36","v":""},{"$f":"EingabeAngabe!J36","v":""},{"$f":"EingabeAngabe!K36","v":""},{"$f":"EingabeAngabe!L36","v":""},{"$f":"EingabeAngabe!M36","v":""},{"$f":"EingabeAngabe!N36","v":""},{"$f":"EingabeAngabe!O36","v":""},{"$f":"EingabeAngabe!P36","v":""},{"$f":"EingabeAngabe!Q36","v":""},{"$f":"EingabeAngabe!R36","v":""},{"$f":"EingabeAngabe!S36","v":""},{"$f":"EingabeAngabe!T36","v":""},{"$f":"EingabeAngabe!U36","v":""},{"$f":"EingabeAngabe!V36","v":""},{"$f":"EingabeAngabe!W36","v":""},{"$f":"EingabeAngabe!X36","v":""},{"$f":"EingabeAngabe!Y36","v":""},{"$f":"EingabeAngabe!Z36","v":""},{"$f":"EingabeAngabe!AA36","v":""},{"$f":"EingabeAngabe!AB36","v":""},{"$f":"EingabeAngabe!AC36","v":""},{"$f":"EingabeAngabe!AD36","v":""},{"$f":"EingabeAngabe!AE36","v":""},{"$f":"EingabeAngabe!AF36","v":""},{"$f":"EingabeAngabe!AG36","v":""},{"$f":"EingabeAngabe!AH36","v":""},{"$f":"EingabeAngabe!AI36","v":""},{"$f":"EingabeAngabe!AJ36","v":""}]
[{"$f":"EingabeAngabe!B37","v":0},{"$f":"EingabeAngabe!C37","v":"SPRACHLICHE QUALITÄT IN DER ZIELSPRACHE"}]
[{"$f":"EingabeAngabe!B38","v":0},null,null,{"$f":"EingabeAngabe!G38","v":""},{"$f":"EingabeAngabe!H38","v":""},{"$f":"EingabeAngabe!I38","v":""},{"$f":"EingabeAngabe!J38","v":""},{"$f":"EingabeAngabe!K38","v":""},{"$f":"EingabeAngabe!L38","v":""},{"$f":"EingabeAngabe!M38","v":""},{"$f":"EingabeAngabe!N38","v":""},{"$f":"EingabeAngabe!O38","v":""},{"$f":"EingabeAngabe!P38","v":""},{"$f":"EingabeAngabe!Q38","v":""},{"$f":"EingabeAngabe!R38","v":""},{"$f":"EingabeAngabe!S38","v":""},{"$f":"EingabeAngabe!T38","v":""},{"$f":"EingabeAngabe!U38","v":""},{"$f":"EingabeAngabe!V38","v":""},{"$f":"EingabeAngabe!W38","v":""},{"$f":"EingabeAngabe!X38","v":""},{"$f":"EingabeAngabe!Y38","v":""},{"$f":"EingabeAngabe!Z38","v":""},{"$f":"EingabeAngabe!AA38","v":""},{"$f":"EingabeAngabe!AB38","v":""},{"$f":"EingabeAngabe!AC38","v":""},{"$f":"EingabeAngabe!AD38","v":""},{"$f":"EingabeAngabe!AE38","v":""},{"$f":"EingabeAngabe!AF38","v":""},{"$f":"EingabeAngabe!AG38","v":""},{"$f":"EingabeAngabe!AH38","v":""},{"$f":"EingabeAngabe!AI38","v":""},{"$f":"EingabeAngabe!AJ38","v":""}]
[null,"Summe",null,{"$f":"EingabeAngabe!G39","v":""},{"$f":"EingabeAngabe!H39","v":""},{"$f":"EingabeAngabe!I39","v":""},{"$f":"EingabeAngabe!J39","v":""},{"$f":"EingabeAngabe!K39","v":""},{"$f":"EingabeAngabe!L39","v":""},{"$f":"EingabeAngabe!M39","v":""},{"$f":"EingabeAngabe!N39","v":""},{"$f":"EingabeAngabe!O39","v":""},{"$f":"EingabeAngabe!P39","v":""},{"$f":"EingabeAngabe!Q39","v":""},{"$f":"EingabeAngabe!R39","v":""},{"$f":"EingabeAngabe!S39","v":""},{"$f":"EingabeAngabe!T39","v":""},{"$f":"EingabeAngabe!U39","v":""},{"$f":"EingabeAngabe!V39","v":""},{"$f":"EingabeAngabe!W39","v":""},{"$f":"EingabeAngabe!X39","v":""},{"$f":"EingabeAngabe!Y39","v":""},{"$f":"EingabeAngabe!Z39","v":""},{"$f":"EingabeAngabe!AA39","v":""},{"$f":"EingabeAngabe!AB39","v":""},{"$f":"EingabeAngabe!AC39","v":""},{"$f":"EingabeAngabe!AD39","v":""},{"$f":"EingabeAngabe!AE39","v":""},{"$f":"EingabeAngabe!AF39","v":""},{"$f":"EingabeAngabe!AG39","v":""},{"$f":"EingabeAngabe!AH39","v":""},{"$f":"EingabeAngabe!AI39","v":""},{"$f":"EingabeAngabe!AJ39","v":""}]
[{"$f":"EingabeAngabe!B40","v":0},null,{"$f":"EingabeAngabe!F40","v":16},{"$f":"EingabeAngabe!G40","v":""},{"$f":"EingabeAngabe!H40","v":""},{"$f":"EingabeAngabe!I40","v":""},{"$f":"EingabeAngabe!J40","v":""},{"$f":"EingabeAngabe!K40","v":""},{"$f":"EingabeAngabe!L40","v":""},{"$f":"EingabeAngabe!M40","v":""},{"$f":"EingabeAngabe!N40","v":""},{"$f":"EingabeAngabe!O40","v":""},{"$f":"EingabeAngabe!P40","v":""},{"$f":"EingabeAngabe!Q40","v":""},{"$f":"EingabeAngabe!R40","v":""},{"$f":"EingabeAngabe!S40","v":""},{"$f":"EingabeAngabe!T40","v":""},{"$f":"EingabeAngabe!U40","v":""},{"$f":"EingabeAngabe!V40","v":""},{"$f":"EingabeAngabe!W40","v":""},{"$f":"EingabeAngabe!X40","v":""},{"$f":"EingabeAngabe!Y40","v":""},{"$f":"EingabeAngabe!Z40","v":""},{"$f":"EingabeAngabe!AA40","v":""},{"$f":"EingabeAngabe!AB40","v":""},{"$f":"EingabeAngabe!AC40","v":""},{"$f":"EingabeAngabe!AD40","v":""},{"$f":"EingabeAngabe!AE40","v":""},{"$f":"EingabeAngabe!AF40","v":""},{"$f":"EingabeAngabe!AG40","v":""},{"$f":"EingabeAngabe!AH40","v":""},{"$f":"EingabeAngabe!AI40","v":""},{"$f":"EingabeAngabe!AJ40","v":""}]
[{"$f":"EingabeAngabe!B41","v":"IT1"},{"$f":"IF(EingabeAngabe!C41=\"\",\"\",EingabeAngabe!C41)","v":""},{"$f":"EingabeAngabe!F41","v":4},{"$f":"EingabeAngabe!G41","v":""},{"$f":"EingabeAngabe!H41","v":""},{"$f":"EingabeAngabe!I41","v":""},{"$f":"EingabeAngabe!J41","v":""},{"$f":"EingabeAngabe!K41","v":""},{"$f":"EingabeAngabe!L41","v":""},{"$f":"EingabeAngabe!M41","v":""},{"$f":"EingabeAngabe!N41","v":""},{"$f":"EingabeAngabe!O41","v":""},{"$f":"EingabeAngabe!P41","v":""},{"$f":"EingabeAngabe!Q41","v":""},{"$f":"EingabeAngabe!R41","v":""},{"$f":"EingabeAngabe!S41","v":""},{"$f":"EingabeAngabe!T41","v":""},{"$f":"EingabeAngabe!U41","v":""},{"$f":"EingabeAngabe!V41","v":""},{"$f":"EingabeAngabe!W41","v":""},{"$f":"EingabeAngabe!X41","v":""},{"$f":"EingabeAngabe!Y41","v":""},{"$f":"EingabeAngabe!Z41","v":""},{"$f":"EingabeAngabe!AA41","v":""},{"$f":"EingabeAngabe!AB41","v":""},{"$f":"EingabeAngabe!AC41","v":""},{"$f":"EingabeAngabe!AD41","v":""},{"$f":"EingabeAngabe!AE41","v":""},{"$f":"EingabeAngabe!AF41","v":""},{"$f":"EingabeAngabe!AG41","v":""},{"$f":"EingabeAngabe!AH41","v":""},{"$f":"EingabeAngabe!AI41","v":""},{"$f":"EingabeAngabe!AJ41","v":""}]
[{"$f":"EingabeAngabe!B42","v":"IT2"},{"$f":"IF(EingabeAngabe!C42=\"\",\"\",EingabeAngabe!C42)","v":""},{"$f":"EingabeAngabe!F42","v":4},{"$f":"EingabeAngabe!G42","v":""},{"$f":"EingabeAngabe!H42","v":""},{"$f":"EingabeAngabe!I42","v":""},{"$f":"EingabeAngabe!J42","v":""},{"$f":"EingabeAngabe!K42","v":""},{"$f":"EingabeAngabe!L42","v":""},{"$f":"EingabeAngabe!M42","v":""},{"$f":"EingabeAngabe!N42","v":""},{"$f":"EingabeAngabe!O42","v":""},{"$f":"EingabeAngabe!P42","v":""},{"$f":"EingabeAngabe!Q42","v":""},{"$f":"EingabeAngabe!R42","v":""},{"$f":"EingabeAngabe!S42","v":""},{"$f":"EingabeAngabe!T42","v":""},{"$f":"EingabeAngabe!U42","v":""},{"$f":"EingabeAngabe!V42","v":""},{"$f":"EingabeAngabe!W42","v":""},{"$f":"EingabeAngabe!X42","v":""},{"$f":"EingabeAngabe!Y42","v":""},{"$f":"EingabeAngabe!Z42","v":""},{"$f":"EingabeAngabe!AA42","v":""},{"$f":"EingabeAngabe!AB42","v":""},{"$f":"EingabeAngabe!AC42","v":""},{"$f":"EingabeAngabe!AD42","v":""},{"$f":"EingabeAngabe!AE42","v":""},{"$f":"EingabeAngabe!AF42","v":""},{"$f":"EingabeAngabe!AG42","v":""},{"$f":"EingabeAngabe!AH42","v":""},{"$f":"EingabeAngabe!AI42","v":""},{"$f":"EingabeAngabe!AJ42","v":""}]
[{"$f":"EingabeAngabe!B43","v":"IT3"},{"$f":"IF(EingabeAngabe!C43=\"\",\"\",EingabeAngabe!C43)","v":""},{"$f":"EingabeAngabe!F43","v":2},{"$f":"EingabeAngabe!G43","v":""},{"$f":"EingabeAngabe!H43","v":""},{"$f":"EingabeAngabe!I43","v":""},{"$f":"EingabeAngabe!J43","v":""},{"$f":"EingabeAngabe!K43","v":""},{"$f":"EingabeAngabe!L43","v":""},{"$f":"EingabeAngabe!M43","v":""},{"$f":"EingabeAngabe!N43","v":""},{"$f":"EingabeAngabe!O43","v":""},{"$f":"EingabeAngabe!P43","v":""},{"$f":"EingabeAngabe!Q43","v":""},{"$f":"EingabeAngabe!R43","v":""},{"$f":"EingabeAngabe!S43","v":""},{"$f":"EingabeAngabe!T43","v":""},{"$f":"EingabeAngabe!U43","v":""},{"$f":"EingabeAngabe!V43","v":""},{"$f":"EingabeAngabe!W43","v":""},{"$f":"EingabeAngabe!X43","v":""},{"$f":"EingabeAngabe!Y43","v":""},{"$f":"EingabeAngabe!Z43","v":""},{"$f":"EingabeAngabe!AA43","v":""},{"$f":"EingabeAngabe!AB43","v":""},{"$f":"EingabeAngabe!AC43","v":""},{"$f":"EingabeAngabe!AD43","v":""},{"$f":"EingabeAngabe!AE43","v":""},{"$f":"EingabeAngabe!AF43","v":""},{"$f":"EingabeAngabe!AG43","v":""},{"$f":"EingabeAngabe!AH43","v":""},{"$f":"EingabeAngabe!AI43","v":""},{"$f":"EingabeAngabe!AJ43","v":""}]
[{"$f":"EingabeAngabe!B44","v":"IT4"},{"$f":"IF(EingabeAngabe!C44=\"\",\"\",EingabeAngabe!C44)","v":""},{"$f":"EingabeAngabe!F44","v":2},{"$f":"EingabeAngabe!G44","v":""},{"$f":"EingabeAngabe!H44","v":""},{"$f":"EingabeAngabe!I44","v":""},{"$f":"EingabeAngabe!J44","v":""},{"$f":"EingabeAngabe!K44","v":""},{"$f":"EingabeAngabe!L44","v":""},{"$f":"EingabeAngabe!M44","v":""},{"$f":"EingabeAngabe!N44","v":""},{"$f":"EingabeAngabe!O44","v":""},{"$f":"EingabeAngabe!P44","v":""},{"$f":"EingabeAngabe!Q44","v":""},{"$f":"EingabeAngabe!R44","v":""},{"$f":"EingabeAngabe!S44","v":""},{"$f":"EingabeAngabe!T44","v":""},{"$f":"EingabeAngabe!U44","v":""},{"$f":"EingabeAngabe!V44","v":""},{"$f":"EingabeAngabe!W44","v":""},{"$f":"EingabeAngabe!X44","v":""},{"$f":"EingabeAngabe!Y44","v":""},{"$f":"EingabeAngabe!Z44","v":""},{"$f":"EingabeAngabe!AA44","v":""},{"$f":"EingabeAngabe!AB44","v":""},{"$f":"EingabeAngabe!AC44","v":""},{"$f":"EingabeAngabe!AD44","v":""},{"$f":"EingabeAngabe!AE44","v":""},{"$f":"EingabeAngabe!AF44","v":""},{"$f":"EingabeAngabe!AG44","v":""},{"$f":"EingabeAngabe!AH44","v":""},{"$f":"EingabeAngabe!AI44","v":""},{"$f":"EingabeAngabe!AJ44","v":""}]
[{"$f":"EingabeAngabe!B45","v":"IT5"},{"$f":"IF(EingabeAngabe!C45=\"\",\"\",EingabeAngabe!C45)","v":""},{"$f":"EingabeAngabe!F45","v":2},{"$f":"EingabeAngabe!G45","v":""},{"$f":"EingabeAngabe!H45","v":""},{"$f":"EingabeAngabe!I45","v":""},{"$f":"EingabeAngabe!J45","v":""},{"$f":"EingabeAngabe!K45","v":""},{"$f":"EingabeAngabe!L45","v":""},{"$f":"EingabeAngabe!M45","v":""},{"$f":"EingabeAngabe!N45","v":""},{"$f":"EingabeAngabe!O45","v":""},{"$f":"EingabeAngabe!P45","v":""},{"$f":"EingabeAngabe!Q45","v":""},{"$f":"EingabeAngabe!R45","v":""},{"$f":"EingabeAngabe!S45","v":""},{"$f":"EingabeAngabe!T45","v":""},{"$f":"EingabeAngabe!U45","v":""},{"$f":"EingabeAngabe!V45","v":""},{"$f":"EingabeAngabe!W45","v":""},{"$f":"EingabeAngabe!X45","v":""},{"$f":"EingabeAngabe!Y45","v":""},{"$f":"EingabeAngabe!Z45","v":""},{"$f":"EingabeAngabe!AA45","v":""},{"$f":"EingabeAngabe!AB45","v":""},{"$f":"EingabeAngabe!AC45","v":""},{"$f":"EingabeAngabe!AD45","v":""},{"$f":"EingabeAngabe!AE45","v":""},{"$f":"EingabeAngabe!AF45","v":""},{"$f":"EingabeAngabe!AG45","v":""},{"$f":"EingabeAngabe!AH45","v":""},{"$f":"EingabeAngabe!AI45","v":""},{"$f":"EingabeAngabe!AJ45","v":""}]
[{"$f":"EingabeAngabe!B46","v":"IT6"},{"$f":"IF(EingabeAngabe!C46=\"\",\"\",EingabeAngabe!C46)","v":""},{"$f":"EingabeAngabe!F46","v":2},{"$f":"EingabeAngabe!G46","v":""},{"$f":"EingabeAngabe!H46","v":""},{"$f":"EingabeAngabe!I46","v":""},{"$f":"EingabeAngabe!J46","v":""},{"$f":"EingabeAngabe!K46","v":""},{"$f":"EingabeAngabe!L46","v":""},{"$f":"EingabeAngabe!M46","v":""},{"$f":"EingabeAngabe!N46","v":""},{"$f":"EingabeAngabe!O46","v":""},{"$f":"EingabeAngabe!P46","v":""},{"$f":"EingabeAngabe!Q46","v":""},{"$f":"EingabeAngabe!R46","v":""},{"$f":"EingabeAngabe!S46","v":""},{"$f":"EingabeAngabe!T46","v":""},{"$f":"EingabeAngabe!U46","v":""},{"$f":"EingabeAngabe!V46","v":""},{"$f":"EingabeAngabe!W46","v":""},{"$f":"EingabeAngabe!X46","v":""},{"$f":"EingabeAngabe!Y46","v":""},{"$f":"EingabeAngabe!Z46","v":""},{"$f":"EingabeAngabe!AA46","v":""},{"$f":"EingabeAngabe!AB46","v":""},{"$f":"EingabeAngabe!AC46","v":""},{"$f":"EingabeAngabe!AD46","v":""},{"$f":"EingabeAngabe!AE46","v":""},{"$f":"EingabeAngabe!AF46","v":""},{"$f":"EingabeAngabe!AG46","v":""},{"$f":"EingabeAngabe!AH46","v":""},{"$f":"EingabeAngabe!AI46","v":""},{"$f":"EingabeAngabe!AJ46","v":""}]

{"sheet":"Schueler1Punkte","index":4,"n_rows":31,"n_cols":13,"rows_kept":31,"cut":false,"hidden":false,"merged":[[15,0,16,0],[7,0,8,0],[9,0,10,0],[2,1,2,4],[3,5,4,5],[4,1,4,4],[11,0,12,0],[13,0,14,0],[8,1,8,4],[15,1,15,4],[15,5,16,5],[9,1,9,4],[10,1,10,4],[1,5,2,5],[1,6,2,6],[7,5,8,5],[7,6,8,6],[7,7,7,13],[8,7,8,10],[8,11,8,13],[3,8,3,11],[4,8,4,11],[9,5,10,5],[9,6,10,6],[3,6,4,6],[9,7,9,10],[10,7,10,10],[26,3,26,4],[27,1,27,2],[27,3,27,4],[21,1,21,2],[21,3,21,4],[25,1,25,2],[25,3,25,4],[22,1,22,2],[22,3,22,4],[23,1,23,2],[23,3,23,4],[24,1,24,2],[24,3,24,4],[17,1,17,2],[18,1,18,2],[19,1,19,2],[20,1,20,2],[26,1,26,2],[7,1,7,4],[15,6,16,6],[16,1,16,4],[11,1,11,4],[11,5,12,5],[11,6,12,6],[12,1,12,4],[13,1,13,4],[13,5,14,5],[13,6,14,6],[14,1,14,4],[0,7,0,11],[5,1,5,4],[5,5,6,5],[0,0,0,1],[1,1,1,4],[3,1,3,4],[5,8,5,11],[1,0,2,0],[3,0,4,0],[5,0,6,0],[6,8,6,11],[0,3,0,4],[5,6,6,6],[6,1,6,4],[1,8,1,11],[2,8,2,11],[12,11,12,13],[13,7,13,13],[14,7,21,13],[11,7,11,10],[23,7,26,13],[9,11,9,13],[10,11,10,13],[29,1,29,3],[30,7,30,9],[30,10,30,13],[27,7,27,11],[28,7,28,11],[29,7,29,11],[28,12,28,13],[29,12,29,13],[27,12,27,13],[28,1,28,2],[28,3,28,4],[22,7,22,10],[12,7,12,10],[11,11,11,13]]}
["Übersetzungstext",null,"Schülername",{"$f":"SchuelernamenEingabe!B2","v":0},null,null,null,"Arbeitsaufgaben/ Interpretation"]
[{"$f":"EingabeAngabe!B6","v":"SE1"},{"$f":"IF(EingabeAngabe!C6=\"\",\"\",EingabeAngabe!C6)","v":""},null,null,null,{"$f":"IF(OR(G2=\"\",G2>EingabeAngabe!F6),\"F\",EingabeAngabe!B6)","v":"F"},null,{"$f":"EingabeAngabe!B41","v":"IT1"},{"$f":"IF(EingabeAngabe!C41=\"\",\"\",EingabeAngabe!C41)","v":""},null,null,null,{"$f":"IF(N2>EingabeAngabe!F41,\"F\",IF(EingabeAngabe!F41=\"\",\"\",EingabeAngabe!F41))","v":4}]
[null,{"$f":"IF(EingabeAngabe!C7=\"\",\"\",EingabeAngabe!C7)","v":""},null,null,null,null,null,{"$f":"EingabeAngabe!B42","v":"IT2"},{"$f":"IF(EingabeAngabe!C42=\"\",\"\",EingabeAngabe!C42)","v":""},null,null,null,{"$f":"IF(N3>EingabeAngabe!F42,\"F\",IF(EingabeAngabe!F42=\"\",\"\",EingabeAngabe!F42))","v":4}]
[{"$f":"EingabeAngabe!B8","v":"SE2"},{"$f":"IF(EingabeAngabe!C8=\"\",\"\",EingabeAngabe!C8)","v":""},null,null,null,{"$f":"IF(OR(G4=\"\",G4>EingabeAngabe!F8),\"F\",EingabeAngabe!B8)","v":"F"},null,{"$f":"EingabeAngabe!B43","v":"IT3"},{"$f":"IF(EingabeAngabe!C43=\"\",\"\",EingabeAngabe!C43)","v":""},null,null,null,{"$f":"IF(N4>EingabeAngabe!F43,\"F\",IF(EingabeAngabe!F43=\"\",\"\",EingabeAngabe!F43))","v":2}]
[null,{"$f":"IF(EingabeAngabe!C9=\"\",\"\",EingabeAngabe!C9)","v":""},null,null,null,null,null,{"$f":"EingabeAngabe!B44","v":"IT4"},{"$f":"IF(EingabeAngabe!C44=\"\",\"\",EingabeAngabe!C44)","v":""},null,null,null,{"$f":"IF(N5>EingabeAngabe!F44,\"F\",IF(EingabeAngabe!F44=\"\",\"\",EingabeAngabe!F44))","v":2}]
[{"$f":"EingabeAngabe!B10","v":"SE3"},{"$f":"IF(EingabeAngabe!C10=\"\",\"\",EingabeAngabe!C10)","v":""},null,null,null,{"$f":"IF(OR(G6=\"\",G6>EingabeAngabe!F10),\"F\",EingabeAngabe!B10)","v":"F"},null,{"$f":"EingabeAngabe!B45","v":"IT5"},{"$f":"IF(EingabeAngabe!C45=\"\",\"\",EingabeAngabe!C45)","v":""},null,null,null,{"$f":"IF(N6>EingabeAngabe!F45,\"F\",IF(EingabeAngabe!F45=\"\",\"\",EingabeAngabe!F45))","v":2}]
[null,{"$f":"IF(EingabeAngabe!C11=\"\",\"\",EingabeAngabe!C11)","v":""},null,null,null,null,null,{"$f":"EingabeAngabe!B46","v":"IT6"},{"$f":"IF(EingabeAngabe!C46=\"\",\"\",EingabeAngabe!C46)","v":""},null,null,null,{"$f":"IF(N7>EingabeAngabe!F46,\"F\",IF(EingabeAngabe!F46=\"\",\"\",EingabeAngabe!F46))","v":2}]
[{"$f":"EingabeAngabe!B12","v":"SE4"},{"$f":"IF(EingabeAngabe!C12=\"\",\"\",EingabeAngabe!C12)","v":""},null,null,null,{"$f":"IF(OR(G8=\"\",G8>EingabeAngabe!F12),\"F\",EingabeAngabe!B12)","v":"F"},null,"Notenschlüssel:"]
[null,{"$f":"IF(EingabeAngabe!C13=\"\",\"\",EingabeAngabe!C13)","v":""},null,null,null,null,null,"Sehr gut",null,null,null,{"$f":"EingabeAngabe!F50","v":"40 - 36"}]
[{"$f":"EingabeAngabe!B14","v":"SE5"},{"$f":"IF(EingabeAngabe!C14=\"\",\"\",EingabeAngabe!C14)","v":""},null,null,null,{"$f":"IF(OR(G10=\"\",G10>EingabeAngabe!F14),\"F\",EingabeAngabe!B14)","v":"F"},null,"Gut",null,null,null,{"$f":"EingabeAngabe!F51","v":"35 - 31"}]
[null,{"$f":"IF(EingabeAngabe!C15=\"\",\"\",EingabeAngabe!C15)","v":""},null,null,null,null,null,"Befriedigend",null,null,null,{"$f":"EingabeAngabe!F52","v":"30 - 26"}]
[{"$f":"EingabeAngabe!B16","v":"SE6"},{"$f":"IF(EingabeAngabe!C16=\"\",\"\",EingabeAngabe!C16)","v":""},null,null,null,{"$f":"IF(OR(G12=\"\",G12>EingabeAngabe!F16),\"F\",EingabeAngabe!B16)","v":"F"},null,"Genügend",null,null,null,{"$f":"EingabeAngabe!F53","v":"25 - 20"}]
[null,{"$f":"IF(EingabeAngabe!C17=\"\",\"\",EingabeAngabe!C17)","v":""},null,null,null,null,null,"Nicht genügend",null,null,null,{"$f":"EingabeAngabe!F54","v":"19 - 00"}]
[{"$f":"EingabeAngabe!B18","v":"SE7"},{"$f":"IF(EingabeAngabe!C18=\"\",\"\",EingabeAngabe!C18)","v":""},null,null,null,{"$f":"IF(OR(G14=\"\",G14>EingabeAngabe!F18),\"F\",EingabeAngabe!B18)","v":"F"},null,{"$f":"CONCATENATE(\"Notendefinition laut LBVO$14:\",\"            \",K31)","v":"Notendefinition laut LBVO$14:            "}]
[null,{"$f":"IF(EingabeAngabe!C19=\"\",\"\",EingabeAngabe!C19)","v":""},null,null,null,null,null,{"$f":"VLOOKUP(K31,SchuelernamenEingabe!D2:'SchuelernamenEingabe'!E40,2,FALSE)","v":{"$error":"#N/A"}}]
[{"$f":"EingabeAngabe!B20","v":"SE8"},{"$f":"IF(EingabeAngabe!C20=\"\",\"\",EingabeAngabe!C20)","v":""},null,null,null,{"$f":"IF(OR(G16=\"\",G16>EingabeAngabe!F20),\"F\",EingabeAngabe!B20)","v":"F"}]
[null,{"$f":"IF(EingabeAngabe!C21=\"\",\"\",EingabeAngabe!C21)","v":""}]
[{"$f":"EingabeAngabe!B23","v":"LE13"},{"$f":"IF(EingabeAngabe!C23=\"\",\"\",EingabeAngabe!C23)","v":""},null,{"$f":"IF(EingabeAngabe!D23=\"\",\"\",EingabeAngabe!D23)","v":""},{"$f":"IF(EingabeAngabe!E23=\"\",\"\",EingabeAngabe!E23)","v":""},{"$f":"IF(OR(G18=\"\",G18>EingabeAngabe!F23),\"F\",EingabeAngabe!B23)","v":"F"}]
[{"$f":"EingabeAngabe!B24","v":"LE14"},{"$f":"IF(EingabeAngabe!C24=\"\",\"\",EingabeAngabe!C24)","v":""},null,{"$f":"IF(EingabeAngabe!D24=\"\",\"\",EingabeAngabe!D24)","v":""},{"$f":"IF(EingabeAngabe!E24=\"\",\"\",EingabeAngabe!E24)","v":""},{"$f":"IF(OR(G19=\"\",G19>EingabeAngabe!F24),\"F\",EingabeAngabe!B24)","v":"F"}]
[{"$f":"EingabeAngabe!B25","v":"LE15"},{"$f":"IF(EingabeAngabe!C25=\"\",\"\",EingabeAngabe!C25)","v":""},null,{"$f":"IF(EingabeAngabe!D25=\"\",\"\",EingabeAngabe!D25)","v":""},{"$f":"IF(EingabeAngabe!E25=\"\",\"\",EingabeAngabe!E25)","v":""},{"$f":"IF(OR(G20=\"\",G20>EingabeAngabe!F25),\"F\",EingabeAngabe!B25)","v":"F"}]
[{"$f":"EingabeAngabe!B26","v":"LE16"},{"$f":"IF(EingabeAngabe!C26=\"\",\"\",EingabeAngabe!C26)","v":""},null,{"$f":"IF(EingabeAngabe!D26=\"\",\"\",EingabeAngabe!D26)","v":""},{"$f":"IF(EingabeAngabe!E26=\"\",\"\",EingabeAngabe!E26)","v":""},{"$f":"IF(OR(G21=\"\",G21>EingabeAngabe!F26),\"F\",EingabeAngabe!B26)","v":"F"}]
[{"$f":"EingabeAngabe!B28","v":"MO19"},{"$f":"IF(EingabeAngabe!C28=\"\",\"\",EingabeAngabe!C28)","v":""},null,{"$f":"IF(EingabeAngabe!D28=\"\",\"\",EingabeAngabe!D28)","v":""},null,{"$f":"IF(OR(G22=\"\",G22>EingabeAngabe!F27),\"F\",EingabeAngabe!B28)","v":"F"}]
[{"$f":"EingabeAngabe!B29","v":"MO20"},{"$f":"IF(EingabeAngabe!C29=\"\",\"\",EingabeAngabe!C29)","v":""},null,{"$f":"IF(EingabeAngabe!D29=\"\",\"\",EingabeAngabe!D29)","v":""},null,{"$f":"IF(OR(G23=\"\",G23>EingabeAngabe!F28),\"F\",EingabeAngabe!B29)","v":"F"},null,{"$f":"IF(EingabeAngabe!F60>\"\",EingabeAngabe!E59,\"\")","v":"Eigener Notenkommentar:"}]
[{"$f":"EingabeAngabe!B30","v":"MO21"},{"$f":"IF(EingabeAngabe!C30=\"\",\"\",EingabeAngabe!C30)","v":""},null,{"$f":"IF(EingabeAngabe!D30=\"\",\"\",EingabeAngabe!D30)","v":""},null,{"$f":"IF(OR(G24=\"\",G24>EingabeAngabe!F29),\"F\",EingabeAngabe!B30)","v":"F"}]
[{"$f":"EingabeAngabe!B31","v":"MO22"},{"$f":"IF(EingabeAngabe!C31=\"\",\"\",EingabeAngabe!C31)","v":""},null,{"$f":"IF(EingabeAngabe!D31=\"\",\"\",EingabeAngabe!D31)","v":""},null,{"$f":"IF(OR(G25=\"\",G25>EingabeAngabe!F30),\"F\",EingabeAngabe!B31)","v":"F"}]
[{"$f":"EingabeAngabe!B33","v":"SY25"},{"$f":"IF(EingabeAngabe!C33=\"\",\"\",EingabeAngabe!C33)","v":""},null,{"$f":"IF(EingabeAngabe!D33=\"\",\"\",EingabeAngabe!D33)","v":""},null,{"$f":"IF(OR(G26=\"\",G26>EingabeAngabe!F31),\"F\",EingabeAngabe!B33)","v":"F"}]
[{"$f":"EingabeAngabe!B34","v":"SY26"},{"$f":"IF(EingabeAngabe!C34=\"\",\"\",EingabeAngabe!C34)","v":""},null,{"$f":"IF(EingabeAngabe!D34=\"\",\"\",EingabeAngabe!D34)","v":""},null,{"$f":"IF(OR(G27=\"\",G27>EingabeAngabe!F32),\"F\",EingabeAngabe!B34)","v":"F"}]
[{"$f":"EingabeAngabe!B35","v":"SY27"},{"$f":"IF(EingabeAngabe!C35=\"\",\"\",EingabeAngabe!C35)","v":""},null,{"$f":"IF(EingabeAngabe!D35=\"\",\"\",EingabeAngabe!D35)","v":""},null,{"$f":"IF(OR(G28=\"\",G28>EingabeAngabe!F33),\"F\",EingabeAngabe!B35)","v":"F"},null,"Summe Übersetzungstext",null,null,null,null,{"$f":"EingabeAngabe!G39","v":""}]
[{"$f":"EingabeAngabe!B36","v":"SY28"},{"$f":"IF(EingabeAngabe!C36=\"\",\"\",EingabeAngabe!C36)","v":""},null,{"$f":"IF(EingabeAngabe!D36=\"\",\"\",EingabeAngabe!D36)","v":""},null,{"$f":"IF(OR(G29=\"\",G29>EingabeAngabe!F34),\"F\",EingabeAngabe!B36)","v":"F"},null,"Summe Arbeitsaufgaben und Interpretation",null,null,null,null,{"$f":"EingabeAngabe!G40","v":""}]
[null,{"$f":"EingabeAngabe!C37","v":"SPRACHLICHE QUALITÄT IN DER ZIELSPRACHE"},null,null,null,{"$f":"IF(OR(G30=1,G30=3,G30=5,G30>5),\"F\",\"4/2/0\")","v":"4/2/0"},null,"Gesamtsumme",null,null,null,null,{"$f":"EingabeAngabe!G2","v":""}]
[null,null,null,null,null,null,null,"NOTE",null,null,{"$f":"IF(EingabeAngabe!G3=1,\"Sehr gut\",IF(EingabeAngabe!G3=2,\"Gut\",IF(EingabeAngabe!G3=3,\"Befriedigend\",IF(EingabeAngabe!G3=4,\"Genügend\",IF(EingabeAngabe!G3=5,\"Nicht genügend\",\"\")))))","v":""}]

{"sheet":"Schueler2Punkte","index":5,"n_rows":31,"n_cols":13,"rows_kept":31,"cut":false,"hidden":false,"merged":[[28,1,28,2],[29,1,29,3],[29,7,29,11],[29,12,29,13],[30,7,30,9],[30,10,30,13],[27,7,27,11],[27,12,27,13],[28,3,28,4],[28,7,28,11],[28,12,28,13],[22,7,22,10],[23,1,23,2],[23,3,23,4],[23,7,26,13],[24,1,24,2],[24,3,24,4],[25,3,25,4],[26,3,26,4],[22,1,22,2],[22,3,22,4],[25,1,25,2],[26,1,26,2],[27,1,27,2],[27,3,27,4],[15,0,16,0],[15,1,15,4],[15,5,16,5],[15,6,16,6],[16,1,16,4],[13,7,13,13],[14,7,21,13],[17,1,17,2],[18,1,18,2],[19,1,19,2],[20,1,20,2],[21,1,21,2],[21,3,21,4],[13,0,14,0],[13,1,13,4],[13,5,14,5],[13,6,14,6],[14,1,14,4],[10,11,10,13],[11,7,11,10],[11,11,11,13],[12,7,12,10],[12,11,12,13],[7,7,7,13],[8,7,8,10],[8,11,8,13],[11,0,12,0],[11,1,11,4],[11,5,12,5],[11,6,12,6],[12,1,12,4],[9,0,10,0],[9,1,9,4],[9,5,10,5],[9,6,10,6],[10,1,10,4],[9,7,9,10],[9,11,9,13],[10,7,10,10],[5,0,6,0],[5,1,5,4],[5,5,6,5],[5,6,6,6],[5,8,5,11],[6,1,6,4],[6,8,6,11],[7,0,8,0],[7,1,7,4],[7,5,8,5],[7,6,8,6],[8,1,8,4],[0,0,0,1],[0,3,0,4],[0,7,0,11],[1,0,2,0],[1,1,1,4],[1,5,2,5],[1,6,2,6],[1,8,1,11],[2,1,2,4],[2,8,2,11],[3,0,4,0],[3,1,3,4],[3,5,4,5],[3,6,4,6],[3,8,3,11],[4,1,4,4],[4,8,4,11]]}
["Übersetzungstext",null,"Schülername",{"$f":"SchuelernamenEingabe!B3","v":0},null,null,null,"Arbeitsaufgaben/ Interpretation"]
[{"$f":"EingabeAngabe!B6","v":"SE1"},{"$f":"IF(EingabeAngabe!C6=\"\",\"\",EingabeAngabe!C6)","v":""},null,null,null,{"$f":"IF(OR(G2=\"\",G2>EingabeAngabe!F6),\"F\",EingabeAngabe!B6)","v":"F"},null,{"$f":"EingabeAngabe!B41","v":"IT1"},{"$f":"IF(EingabeAngabe!C41=\"\",\"\",EingabeAngabe!C41)","v":""},null,null,null,{"$f":"IF(N2>EingabeAngabe!F41,\"F\",IF(EingabeAngabe!F41=\"\",\"\",EingabeAngabe!F41))","v":4}]
[null,{"$f":"IF(EingabeAngabe!C7=\"\",\"\",EingabeAngabe!C7)","v":""},null,null,null,null,null,{"$f":"EingabeAngabe!B42","v":"IT2"},{"$f":"IF(EingabeAngabe!C42=\"\",\"\",EingabeAngabe!C42)","v":""},null,null,null,{"$f":"IF(N3>EingabeAngabe!F42,\"F\",IF(EingabeAngabe!F42=\"\",\"\",EingabeAngabe!F42))","v":4}]
[{"$f":"EingabeAngabe!B8","v":"SE2"},{"$f":"IF(EingabeAngabe!C8=\"\",\"\",EingabeAngabe!C8)","v":""},null,null,null,{"$f":"IF(OR(G4=\"\",G4>EingabeAngabe!F8),\"F\",EingabeAngabe!B8)","v":"F"},null,{"$f":"EingabeAngabe!B43","v":"IT3"},{"$f":"IF(EingabeAngabe!C43=\"\",\"\",EingabeAngabe!C43)","v":""},null,null,null,{"$f":"IF(N4>EingabeAngabe!F43,\"F\",IF(EingabeAngabe!F43=\"\",\"\",EingabeAngabe!F43))","v":2}]
[null,{"$f":"IF(EingabeAngabe!C9=\"\",\"\",EingabeAngabe!C9)","v":""},null,null,null,null,null,{"$f":"EingabeAngabe!B44","v":"IT4"},{"$f":"IF(EingabeAngabe!C44=\"\",\"\",EingabeAngabe!C44)","v":""},null,null,null,{"$f":"IF(N5>EingabeAngabe!F44,\"F\",IF(EingabeAngabe!F44=\"\",\"\",EingabeAngabe!F44))","v":2}]
[{"$f":"EingabeAngabe!B10","v":"SE3"},{"$f":"IF(EingabeAngabe!C10=\"\",\"\",EingabeAngabe!C10)","v":""},null,null,null,{"$f":"IF(OR(G6=\"\",G6>EingabeAngabe!F10),\"F\",EingabeAngabe!B10)","v":"F"},null,{"$f":"EingabeAngabe!B45","v":"IT5"},{"$f":"IF(EingabeAngabe!C45=\"\",\"\",EingabeAngabe!C45)","v":""},null,null,null,{"$f":"IF(N6>EingabeAngabe!F45,\"F\",IF(EingabeAngabe!F45=\"\",\"\",EingabeAngabe!F45))","v":2}]
[null,{"$f":"IF(EingabeAngabe!C11=\"\",\"\",EingabeAngabe!C11)","v":""},null,null,null,null,null,{"$f":"EingabeAngabe!B46","v":"IT6"},{"$f":"IF(EingabeAngabe!C46=\"\",\"\",EingabeAngabe!C46)","v":""},null,null,null,{"$f":"IF(N7>EingabeAngabe!F46,\"F\",IF(EingabeAngabe!F46=\"\",\"\",EingabeAngabe!F46))","v":2}]
[{"$f":"EingabeAngabe!B12","v":"SE4"},{"$f":"IF(EingabeAngabe!C12=\"\",\"\",EingabeAngabe!C12)","v":""},null,null,null,{"$f":"IF(OR(G8=\"\",G8>EingabeAngabe!F12),\"F\",EingabeAngabe!B12)","v":"F"},null,"Notenschlüssel:"]
[null,{"$f":"IF(EingabeAngabe!C13=\"\",\"\",EingabeAngabe!C13)","v":""},null,null,null,null,null,"Sehr gut",null,null,null,{"$f":"EingabeAngabe!F50","v":"40 - 36"}]
[{"$f":"EingabeAngabe!B14","v":"SE5"},{"$f":"IF(EingabeAngabe!C14=\"\",\"\",EingabeAngabe!C14)","v":""},null,null,null,{"$f":"IF(OR(G10=\"\",G10>EingabeAngabe!F14),\"F\",EingabeAngabe!B14)","v":"F"},null,"Gut",null,null,null,{"$f":"EingabeAngabe!F51","v":"35 - 31"}]
[null,{"$f":"IF(EingabeAngabe!C15=\"\",\"\",EingabeAngabe!C15)","v":""},null,null,null,null,null,"Befriedigend",null,null,null,{"$f":"EingabeAngabe!F52","v":"30 - 26"}]
[{"$f":"EingabeAngabe!B16","v":"SE6"},{"$f":"IF(EingabeAngabe!C16=\"\",\"\",EingabeAngabe!C16)","v":""},null,null,null,{"$f":"IF(OR(G12=\"\",G12>EingabeAngabe!F16),\"F\",EingabeAngabe!B16)","v":"F"},null,"Genügend",null,null,null,{"$f":"EingabeAngabe!F53","v":"25 - 20"}]
[null,{"$f":"IF(EingabeAngabe!C17=\"\",\"\",EingabeAngabe!C17)","v":""},null,null,null,null,null,"Nicht genügend",null,null,null,{"$f":"EingabeAngabe!F54","v":"19 - 00"}]
[{"$f":"EingabeAngabe!B18","v":"SE7"},{"$f":"IF(EingabeAngabe!C18=\"\",\"\",EingabeAngabe!C18)","v":""},null,null,null,{"$f":"IF(OR(G14=\"\",G14>EingabeAngabe!F18),\"F\",EingabeAngabe!B18)","v":"F"},null,{"$f":"CONCATENATE(\"Notendefinition laut LBVO$14:\",\"            \",K31)","v":"Notendefinition laut LBVO$14:            "}]
[null,{"$f":"IF(EingabeAngabe!C19=\"\",\"\",EingabeAngabe!C19)","v":""},null,null,null,null,null,{"$f":"VLOOKUP(K31,SchuelernamenEingabe!D2:'SchuelernamenEingabe'!E40,2,FALSE)","v":{"$error":"#N/A"}}]
[{"$f":"EingabeAngabe!B20","v":"SE8"},{"$f":"IF(EingabeAngabe!C20=\"\",\"\",EingabeAngabe!C20)","v":""},null,null,null,{"$f":"IF(OR(G16=\"\",G16>EingabeAngabe!F20),\"F\",EingabeAngabe!B20)","v":"F"}]
[null,{"$f":"IF(EingabeAngabe!C21=\"\",\"\",EingabeAngabe!C21)","v":""}]
[{"$f":"EingabeAngabe!B23","v":"LE13"},{"$f":"IF(EingabeAngabe!C23=\"\",\"\",EingabeAngabe!C23)","v":""},null,{"$f":"IF(EingabeAngabe!D23=\"\",\"\",EingabeAngabe!D23)","v":""},{"$f":"IF(EingabeAngabe!E23=\"\",\"\",EingabeAngabe!E23)","v":""},{"$f":"IF(OR(G18=\"\",G18>EingabeAngabe!F23),\"F\",EingabeAngabe!B23)","v":"F"}]
[{"$f":"EingabeAngabe!B24","v":"LE14"},{"$f":"IF(EingabeAngabe!C24=\"\",\"\",EingabeAngabe!C24)","v":""},null,{"$f":"IF(EingabeAngabe!D24=\"\",\"\",EingabeAngabe!D24)","v":""},{"$f":"IF(EingabeAngabe!E24=\"\",\"\",EingabeAngabe!E24)","v":""},{"$f":"IF(OR(G19=\"\",G19>EingabeAngabe!F24),\"F\",EingabeAngabe!B24)","v":"F"}]
[{"$f":"EingabeAngabe!B25","v":"LE15"},{"$f":"IF(EingabeAngabe!C25=\"\",\"\",EingabeAngabe!C25)","v":""},null,{"$f":"IF(EingabeAngabe!D25=\"\",\"\",EingabeAngabe!D25)","v":""},{"$f":"IF(EingabeAngabe!E25=\"\",\"\",EingabeAngabe!E25)","v":""},{"$f":"IF(OR(G20=\"\",G20>EingabeAngabe!F25),\"F\",EingabeAngabe!B25)","v":"F"}]
[{"$f":"EingabeAngabe!B26","v":"LE16"},{"$f":"IF(EingabeAngabe!C26=\"\",\"\",EingabeAngabe!C26)","v":""},null,{"$f":"IF(EingabeAngabe!D26=\"\",\"\",EingabeAngabe!D26)","v":""},{"$f":"IF(EingabeAngabe!E26=\"\",\"\",EingabeAngabe!E26)","v":""},{"$f":"IF(OR(G21=\"\",G21>EingabeAngabe!F26),\"F\",EingabeAngabe!B26)","v":"F"}]
[{"$f":"EingabeAngabe!B28","v":"MO19"},{"$f":"IF(EingabeAngabe!C28=\"\",\"\",EingabeAngabe!C28)","v":""},null,{"$f":"IF(EingabeAngabe!D28=\"\",\"\",EingabeAngabe!D28)","v":""},null,{"$f":"IF(OR(G22=\"\",G22>EingabeAngabe!F27),\"F\",EingabeAngabe!B28)","v":"F"}]
[{"$f":"EingabeAngabe!B29","v":"MO20"},{"$f":"IF(EingabeAngabe!C29=\"\",\"\",EingabeAngabe!C29)","v":""},null,{"$f":"IF(EingabeAngabe!D29=\"\",\"\",EingabeAngabe!D29)","v":""},null,{"$f":"IF(OR(G23=\"\",G23>EingabeAngabe!F28),\"F\",EingabeAngabe!B29)","v":"F"},null,{"$f":"IF(EingabeAngabe!F60>\"\",EingabeAngabe!E59,\"\")","v":"Eigener Notenkommentar:"}]
[{"$f":"EingabeAngabe!B30","v":"MO21"},{"$f":"IF(EingabeAngabe!C30=\"\",\"\",EingabeAngabe!C30)","v":""},null,{"$f":"IF(EingabeAngabe!D30=\"\",\"\",EingabeAngabe!D30)","v":""},null,{"$f":"IF(OR(G24=\"\",G24>EingabeAngabe!F29),\"F\",EingabeAngabe!B30)","v":"F"}]
[{"$f":"EingabeAngabe!B31","v":"MO22"},{"$f":"IF(EingabeAngabe!C31=\"\",\"\",EingabeAngabe!C31)","v":""},null,{"$f":"IF(EingabeAngabe!D31=\"\",\"\",EingabeAngabe!D31)","v":""},null,{"$f":"IF(OR(G25=\"\",G25>EingabeAngabe!F30),\"F\",EingabeAngabe!B31)","v":"F"}]
[{"$f":"EingabeAngabe!B33","v":"SY25"},{"$f":"IF(EingabeAngabe!C33=\"\",\"\",EingabeAngabe!C33)","v":""},null,{"$f":"IF(EingabeAngabe!D33=\"\",\"\",EingabeAngabe!D33)","v":""},null,{"$f":"IF(OR(G26=\"\",G26>EingabeAngabe!F31),\"F\",EingabeAngabe!B33)","v":"F"}]
[{"$f":"EingabeAngabe!B34","v":"SY26"},{"$f":"IF(EingabeAngabe!C34=\"\",\"\",EingabeAngabe!C34)","v":""},null,{"$f":"IF(EingabeAngabe!D34=\"\",\"\",EingabeAngabe!D34)","v":""},null,{"$f":"IF(OR(G27=\"\",G27>EingabeAngabe!F32),\"F\",EingabeAngabe!B34)","v":"F"}]
[{"$f":"EingabeAngabe!B35","v":"SY27"},{"$f":"IF(EingabeAngabe!C35=\"\",\"\",EingabeAngabe!C35)","v":""},null,{"$f":"IF(EingabeAngabe!D35=\"\",\"\",EingabeAngabe!D35)","v":""},null,{"$f":"IF(OR(G28=\"\",G28>EingabeAngabe!F33),\"F\",EingabeAngabe!B35)","v":"F"},null,"Summe Übersetzungstext",null,null,null,null,{"$f":"EingabeAngabe!H39","v":""}]
[{"$f":"EingabeAngabe!B36","v":"SY28"},{"$f":"IF(EingabeAngabe!C36=\"\",\"\",EingabeAngabe!C36)","v":""},null,{"$f":"IF(EingabeAngabe!D36=\"\",\"\",EingabeAngabe!D36)","v":""},null,{"$f":"IF(OR(G29=\"\",G29>EingabeAngabe!F34),\"F\",EingabeAngabe!B36)","v":"F"},null,"Summe Arbeitsaufgaben und Interpretation",null,null,null,null,{"$f":"EingabeAngabe!H40","v":""}]
[null,{"$f":"EingabeAngabe!C37","v":"SPRACHLICHE QUALITÄT IN DER ZIELSPRACHE"},null,null,null,{"$f":"IF(OR(G30=1,G30=3,G30=5,G30>5),\"F\",\"4/2/0\")","v":"4/2/0"},null,"Gesamtsumme",null,null,null,null,{"$f":"EingabeAngabe!H2","v":""}]
[null,null,null,null,null,null,null,"NOTE",null,null,{"$f":"IF(EingabeAngabe!H3=1,\"Sehr gut\",IF(EingabeAngabe!H3=2,\"Gut\",IF(EingabeAngabe!H3=3,\"Befriedigend\",IF(EingabeAngabe!H3=4,\"Genügend\",IF(EingabeAngabe!H3=5,\"Nicht genügend\",\"\")))))","v":""}]

{"sheet":"Schueler3Punkte","index":6,"n_rows":31,"n_cols":13,"rows_kept":31,"cut":false,"hidden":false,"merged":[[28,1,28,2],[29,1,29,3],[29,7,29,11],[29,12,29,13],[30,7,30,9],[30,10,30,13],[27,7,27,11],[27,12,27,13],[28,3,28,4],[28,7,28,11],[28,12,28,13],[22,7,22,10],[23,1,23,2],[23,3,23,4],[23,7,26,13],[24,1,24,2],[24,3,24,4],[25,3,25,4],[26,3,26,4],[22,1,22,2],[22,3,22,4],[25,1,25,2],[26,1,26,2],[27,1,27,2],[27,3,27,4],[15,0,16,0],[15,1,15,4],[15,5,16,5],[15,6,16,6],[16,1,16,4],[13,7,13,13],[14,7,21,13],[17,1,17,2],[18,1,18,2],[19,1,19,2],[20,1,20,2],[21,1,21,2],[21,3,21,4],[13,0,14,0],[13,1,13,4],[13,5,14,5],[13,6,14,6],[14,1,14,4],[10,11,10,13],[11,7,11,10],[11,11,11,13],[12,7,12,10],[12,11,12,13],[7,7,7,13],[8,7,8,10],[8,11,8,13],[11,0,12,0],[11,1,11,4],[11,5,12,5],[11,6,12,6],[12,1,12,4],[9,0,10,0],[9,1,9,4],[9,5,10,5],[9,6,10,6],[10,1,10,4],[9,7,9,10],[9,11,9,13],[10,7,10,10],[5,0,6,0],[5,1,5,4],[5,5,6,5],[5,6,6,6],[5,8,5,11],[6,1,6,4],[6,8,6,11],[7,0,8,0],[7,1,7,4],[7,5,8,5],[7,6,8,6],[8,1,8,4],[0,0,0,1],[0,3,0,4],[0,7,0,11],[1,0,2,0],[1,1,1,4],[1,5,2,5],[1,6,2,6],[1,8,1,11],[2,1,2,4],[2,8,2,11],[3,0,4,0],[3,1,3,4],[3,5,4,5],[3,6,4,6],[3,8,3,11],[4,1,4,4],[4,8,4,11]]}
["Übersetzungstext",null,"Schülername",{"$f":"SchuelernamenEingabe!B4","v":0},null,null,null,"Arbeitsaufgaben/ Interpretation"]
[{"$f":"EingabeAngabe!B6","v":"SE1"},{"$f":"IF(EingabeAngabe!C6=\"\",\"\",EingabeAngabe!C6)","v":""},null,null,null,{"$f":"IF(OR(G2=\"\",G2>EingabeAngabe!F6),\"F\",EingabeAngabe!B6)","v":"F"},null,{"$f":"EingabeAngabe!B41","v":"IT1"},{"$f":"IF(EingabeAngabe!C41=\"\",\"\",EingabeAngabe!C41)","v":""},null,null,null,{"$f":"IF(N2>EingabeAngabe!F41,\"F\",IF(EingabeAngabe!F41=\"\",\"\",EingabeAngabe!F41))","v":4}]
[null,{"$f":"IF(EingabeAngabe!C7=\"\",\"\",EingabeAngabe!C7)","v":""},null,null,null,null,null,{"$f":"EingabeAngabe!B42","v":"IT2"},{"$f":"IF(EingabeAngabe!C42=\"\",\"\",EingabeAngabe!C42)","v":""},null,null,null,{"$f":"IF(N3>EingabeAngabe!F42,\"F\",IF(EingabeAngabe!F42=\"\",\"\",EingabeAngabe!F42))","v":4}]
[{"$f":"EingabeAngabe!B8","v":"SE2"},{"$f":"IF(EingabeAngabe!C8=\"\",\"\",EingabeAngabe!C8)","v":""},null,null,null,{"$f":"IF(OR(G4=\"\",G4>EingabeAngabe!F8),\"F\",EingabeAngabe!B8)","v":"F"},null,{"$f":"EingabeAngabe!B43","v":"IT3"},{"$f":"IF(EingabeAngabe!C43=\"\",\"\",EingabeAngabe!C43)","v":""},null,null,null,{"$f":"IF(N4>EingabeAngabe!F43,\"F\",IF(EingabeAngabe!F43=\"\",\"\",EingabeAngabe!F43))","v":2}]
[null,{"$f":"IF(EingabeAngabe!C9=\"\",\"\",EingabeAngabe!C9)","v":""},null,null,null,null,null,{"$f":"EingabeAngabe!B44","v":"IT4"},{"$f":"IF(EingabeAngabe!C44=\"\",\"\",EingabeAngabe!C44)","v":""},null,null,null,{"$f":"IF(N5>EingabeAngabe!F44,\"F\",IF(EingabeAngabe!F44=\"\",\"\",EingabeAngabe!F44))","v":2}]
[{"$f":"EingabeAngabe!B10","v":"SE3"},{"$f":"IF(EingabeAngabe!C10=\"\",\"\",EingabeAngabe!C10)","v":""},null,null,null,{"$f":"IF(OR(G6=\"\",G6>EingabeAngabe!F10),\"F\",EingabeAngabe!B10)","v":"F"},null,{"$f":"EingabeAngabe!B45","v":"IT5"},{"$f":"IF(EingabeAngabe!C45=\"\",\"\",EingabeAngabe!C45)","v":""},null,null,null,{"$f":"IF(N6>EingabeAngabe!F45,\"F\",IF(EingabeAngabe!F45=\"\",\"\",EingabeAngabe!F45))","v":2}]
[null,{"$f":"IF(EingabeAngabe!C11=\"\",\"\",EingabeAngabe!C11)","v":""},null,null,null,null,null,{"$f":"EingabeAngabe!B46","v":"IT6"},{"$f":"IF(EingabeAngabe!C46=\"\",\"\",EingabeAngabe!C46)","v":""},null,null,null,{"$f":"IF(N7>EingabeAngabe!F46,\"F\",IF(EingabeAngabe!F46=\"\",\"\",EingabeAngabe!F46))","v":2}]
[{"$f":"EingabeAngabe!B12","v":"SE4"},{"$f":"IF(EingabeAngabe!C12=\"\",\"\",EingabeAngabe!C12)","v":""},null,null,null,{"$f":"IF(OR(G8=\"\",G8>EingabeAngabe!F12),\"F\",EingabeAngabe!B12)","v":"F"},null,"Notenschlüssel:"]
[null,{"$f":"IF(EingabeAngabe!C13=\"\",\"\",EingabeAngabe!C13)","v":""},null,null,null,null,null,"Sehr gut",null,null,null,{"$f":"EingabeAngabe!F50","v":"40 - 36"}]
[{"$f":"EingabeAngabe!B14","v":"SE5"},{"$f":"IF(EingabeAngabe!C14=\"\",\"\",EingabeAngabe!C14)","v":""},null,null,null,{"$f":"IF(OR(G10=\"\",G10>EingabeAngabe!F14),\"F\",EingabeAngabe!B14)","v":"F"},null,"Gut",null,null,null,{"$f":"EingabeAngabe!F51","v":"35 - 31"}]
[null,{"$f":"IF(EingabeAngabe!C15=\"\",\"\",EingabeAngabe!C15)","v":""},null,null,null,null,null,"Befriedigend",null,null,null,{"$f":"EingabeAngabe!F52","v":"30 - 26"}]
[{"$f":"EingabeAngabe!B16","v":"SE6"},{"$f":"IF(EingabeAngabe!C16=\"\",\"\",EingabeAngabe!C16)","v":""},null,null,null,{"$f":"IF(OR(G12=\"\",G12>EingabeAngabe!F16),\"F\",EingabeAngabe!B16)","v":"F"},null,"Genügend",null,null,null,{"$f":"EingabeAngabe!F53","v":"25 - 20"}]
[null,{"$f":"IF(EingabeAngabe!C17=\"\",\"\",EingabeAngabe!C17)","v":""},null,null,null,null,null,"Nicht genügend",null,null,null,{"$f":"EingabeAngabe!F54","v":"19 - 00"}]
[{"$f":"EingabeAngabe!B18","v":"SE7"},{"$f":"IF(EingabeAngabe!C18=\"\",\"\",EingabeAngabe!C18)","v":""},null,null,null,{"$f":"IF(OR(G14=\"\",G14>EingabeAngabe!F18),\"F\",EingabeAngabe!B18)","v":"F"},null,{"$f":"CONCATENATE(\"Notendefinition laut LBVO$14:\",\"            \",K31)","v":"Notendefinition laut LBVO$14:            "}]
[null,{"$f":"IF(EingabeAngabe!C19=\"\",\"\",EingabeAngabe!C19)","v":""},null,null,null,null,null,{"$f":"VLOOKUP(K31,SchuelernamenEingabe!D2:'SchuelernamenEingabe'!E40,2,FALSE)","v":{"$error":"#N/A"}}]
[{"$f":"EingabeAngabe!B20","v":"SE8"},{"$f":"IF(EingabeAngabe!C20=\"\",\"\",EingabeAngabe!C20)","v":""},null,null,null,{"$f":"IF(OR(G16=\"\",G16>EingabeAngabe!F20),\"F\",EingabeAngabe!B20)","v":"F"}]
[null,{"$f":"IF(EingabeAngabe!C21=\"\",\"\",EingabeAngabe!C21)","v":""}]
[{"$f":"EingabeAngabe!B23","v":"LE13"},{"$f":"IF(EingabeAngabe!C23=\"\",\"\",EingabeAngabe!C23)","v":""},null,{"$f":"IF(EingabeAngabe!D23=\"\",\"\",EingabeAngabe!D23)","v":""},{"$f":"IF(EingabeAngabe!E23=\"\",\"\",EingabeAngabe!E23)","v":""},{"$f":"IF(OR(G18=\"\",G18>EingabeAngabe!F23),\"F\",EingabeAngabe!B23)","v":"F"}]
[{"$f":"EingabeAngabe!B24","v":"LE14"},{"$f":"IF(EingabeAngabe!C24=\"\",\"\",EingabeAngabe!C24)","v":""},null,{"$f":"IF(EingabeAngabe!D24=\"\",\"\",EingabeAngabe!D24)","v":""},{"$f":"IF(EingabeAngabe!E24=\"\",\"\",EingabeAngabe!E24)","v":""},{"$f":"IF(OR(G19=\"\",G19>EingabeAngabe!F24),\"F\",EingabeAngabe!B24)","v":"F"}]
[{"$f":"EingabeAngabe!B25","v":"LE15"},{"$f":"IF(EingabeAngabe!C25=\"\",\"\",EingabeAngabe!C25)","v":""},null,{"$f":"IF(EingabeAngabe!D25=\"\",\"\",EingabeAngabe!D25)","v":""},{"$f":"IF(EingabeAngabe!E25=\"\",\"\",EingabeAngabe!E25)","v":""},{"$f":"IF(OR(G20=\"\",G20>EingabeAngabe!F25),\"F\",EingabeAngabe!B25)","v":"F"}]
[{"$f":"EingabeAngabe!B26","v":"LE16"},{"$f":"IF(EingabeAngabe!C26=\"\",\"\",EingabeAngabe!C26)","v":""},null,{"$f":"IF(EingabeAngabe!D26=\"\",\"\",EingabeAngabe!D26)","v":""},{"$f":"IF(EingabeAngabe!E26=\"\",\"\",EingabeAngabe!E26)","v":""},{"$f":"IF(OR(G21=\"\",G21>EingabeAngabe!F26),\"F\",EingabeAngabe!B26)","v":"F"}]
[{"$f":"EingabeAngabe!B28","v":"MO19"},{"$f":"IF(EingabeAngabe!C28=\"\",\"\",EingabeAngabe!C28)","v":""},null,{"$f":"IF(EingabeAngabe!D28=\"\",\"\",EingabeAngabe!D28)","v":""},null,{"$f":"IF(OR(G22=\"\",G22>EingabeAngabe!F27),\"F\",EingabeAngabe!B28)","v":"F"}]
[{"$f":"EingabeAngabe!B29","v":"MO20"},{"$f":"IF(EingabeAngabe!C29=\"\",\"\",EingabeAngabe!C29)","v":""},null,{"$f":"IF(EingabeAngabe!D29=\"\",\"\",EingabeAngabe!D29)","v":""},null,{"$f":"IF(OR(G23=\"\",G23>EingabeAngabe!F28),\"F\",EingabeAngabe!B29)","v":"F"},null,{"$f":"IF(EingabeAngabe!F60>\"\",EingabeAngabe!E59,\"\")","v":"Eigener Notenkommentar:"}]
[{"$f":"EingabeAngabe!B30","v":"MO21"},{"$f":"IF(EingabeAngabe!C30=\"\",\"\",EingabeAngabe!C30)","v":""},null,{"$f":"IF(EingabeAngabe!D30=\"\",\"\",EingabeAngabe!D30)","v":""},null,{"$f":"IF(OR(G24=\"\",G24>EingabeAngabe!F29),\"F\",EingabeAngabe!B30)","v":"F"}]
[{"$f":"EingabeAngabe!B31","v":"MO22"},{"$f":"IF(EingabeAngabe!C31=\"\",\"\",EingabeAngabe!C31)","v":""},null,{"$f":"IF(EingabeAngabe!D31=\"\",\"\",EingabeAngabe!D31)","v":""},null,{"$f":"IF(OR(G25=\"\",G25>EingabeAngabe!F30),\"F\",EingabeAngabe!B31)","v":"F"}]
[{"$f":"EingabeAngabe!B33","v":"SY25"},{"$f":"IF(EingabeAngabe!C33=\"\",\"\",EingabeAngabe!C33)","v":""},null,{"$f":"IF(EingabeAngabe!D33=\"\",\"\",EingabeAngabe!D33)","v":""},null,{"$f":"IF(OR(G26=\"\",G26>EingabeAngabe!F31),\"F\",EingabeAngabe!B33)","v":"F"}]
[{"$f":"EingabeAngabe!B34","v":"SY26"},{"$f":"IF(EingabeAngabe!C34=\"\",\"\",EingabeAngabe!C34)","v":""},null,{"$f":"IF(EingabeAngabe!D34=\"\",\"\",EingabeAngabe!D34)","v":""},null,{"$f":"IF(OR(G27=\"\",G27>EingabeAngabe!F32),\"F\",EingabeAngabe!B34)","v":"F"}]
[{"$f":"EingabeAngabe!B35","v":"SY27"},{"$f":"IF(EingabeAngabe!C35=\"\",\"\",EingabeAngabe!C35)","v":""},null,{"$f":"IF(EingabeAngabe!D35=\"\",\"\",EingabeAngabe!D35)","v":""},null,{"$f":"IF(OR(G28=\"\",G28>EingabeAngabe!F33),\"F\",EingabeAngabe!B35)","v":"F"},null,"Summe Übersetzungstext",null,null,null,null,{"$f":"EingabeAngabe!I39","v":""}]
[{"$f":"EingabeAngabe!B36","v":"SY28"},{"$f":"IF(EingabeAngabe!C36=\"\",\"\",EingabeAngabe!C36)","v":""},null,{"$f":"IF(EingabeAngabe!D36=\"\",\"\",EingabeAngabe!D36)","v":""},null,{"$f":"IF(OR(G29=\"\",G29>EingabeAngabe!F34),\"F\",EingabeAngabe!B36)","v":"F"},null,"Summe Arbeitsaufgaben und Interpretation",null,null,null,null,{"$f":"EingabeAngabe!I40","v":""}]
[null,{"$f":"EingabeAngabe!C37","v":"SPRACHLICHE QUALITÄT IN DER ZIELSPRACHE"},null,null,null,{"$f":"IF(OR(G30=1,G30=3,G30=5,G30>5),\"F\",\"4/2/0\")","v":"4/2/0"},null,"Gesamtsumme",null,null,null,null,{"$f":"EingabeAngabe!I2","v":""}]
[null,null,null,null,null,null,null,"NOTE",null,null,{"$f":"IF(EingabeAngabe!I3=1,\"Sehr gut\",IF(EingabeAngabe!I3=2,\"Gut\",IF(EingabeAngabe!I3=3,\"Befriedigend\",IF(EingabeAngabe!I3=4,\"Genügend\",IF(EingabeAngabe!I3=5,\"Nicht genügend\",\"\")))))","v":""}]

{"sheet":"Schueler4Punkte","index":7,"n_rows":31,"n_cols":13,"rows_kept":31,"cut":false,"hidden":false,"merged":[[28,1,28,2],[29,1,29,3],[29,7,29,11],[29,12,29,13],[30,7,30,9],[30,10,30,13],[27,7,27,11],[27,12,27,13],[28,3,28,4],[28,7,28,11],[28,12,28,13],[22,7,22,10],[23,1,23,2],[23,3,23,4],[23,7,26,13],[24,1,24,2],[24,3,24,4],[25,3,25,4],[26,3,26,4],[22,1,22,2],[22,3,22,4],[25,1,25,2],[26,1,26,2],[27,1,27,2],[27,3,27,4],[15,0,16,0],[15,1,15,4],[15,5,16,5],[15,6,16,6],[16,1,16,4],[13,7,13,13],[14,7,21,13],[17,1,17,2],[18,1,18,2],[19,1,19,2],[20,1,20,2],[21,1,21,2],[21,3,21,4],[13,0,14,0],[13,1,13,4],[13,5,14,5],[13,6,14,6],[14,1,14,4],[10,11,10,13],[11,7,11,10],[11,11,11,13],[12,7,12,10],[12,11,12,13],[7,7,7,13],[8,7,8,10],[8,11,8,13],[11,0,12,0],[11,1,11,4],[11,5,12,5],[11,6,12,6],[12,1,12,4],[9,0,10,0],[9,1,9,4],[9,5,10,5],[9,6,10,6],[10,1,10,4],[9,7,9,10],[9,11,9,13],[10,7,10,10],[5,0,6,0],[5,1,5,4],[5,5,6,5],[5,6,6,6],[5,8,5,11],[6,1,6,4],[6,8,6,11],[7,0,8,0],[7,1,7,4],[7,5,8,5],[7,6,8,6],[8,1,8,4],[0,0,0,1],[0,3,0,4],[0,7,0,11],[1,0,2,0],[1,1,1,4],[1,5,2,5],[1,6,2,6],[1,8,1,11],[2,1,2,4],[2,8,2,11],[3,0,4,0],[3,1,3,4],[3,5,4,5],[3,6,4,6],[3,8,3,11],[4,1,4,4],[4,8,4,11]]}
["Übersetzungstext",null,"Schülername",{"$f":"SchuelernamenEingabe!B5","v":0},null,null,null,"Arbeitsaufgaben/ Interpretation"]
[{"$f":"EingabeAngabe!B6","v":"SE1"},{"$f":"IF(EingabeAngabe!C6=\"\",\"\",EingabeAngabe!C6)","v":""},null,null,null,{"$f":"IF(OR(G2=\"\",G2>EingabeAngabe!F6),\"F\",EingabeAngabe!B6)","v":"F"},null,{"$f":"EingabeAngabe!B41","v":"IT1"},{"$f":"IF(EingabeAngabe!C41=\"\",\"\",EingabeAngabe!C41)","v":""},null,null,null,{"$f":"IF(N2>EingabeAngabe!F41,\"F\",IF(EingabeAngabe!F41=\"\",\"\",EingabeAngabe!F41))","v":4}]
[null,{"$f":"IF(EingabeAngabe!C7=\"\",\"\",EingabeAngabe!C7)","v":""},null,null,null,null,null,{"$f":"EingabeAngabe!B42","v":"IT2"},{"$f":"IF(EingabeAngabe!C42=\"\",\"\",EingabeAngabe!C42)","v":""},null,null,null,{"$f":"IF(N3>EingabeAngabe!F42,\"F\",IF(EingabeAngabe!F42=\"\",\"\",EingabeAngabe!F42))","v":4}]
[{"$f":"EingabeAngabe!B8","v":"SE2"},{"$f":"IF(EingabeAngabe!C8=\"\",\"\",EingabeAngabe!C8)","v":""},null,null,null,{"$f":"IF(OR(G4=\"\",G4>EingabeAngabe!F8),\"F\",EingabeAngabe!B8)","v":"F"},null,{"$f":"EingabeAngabe!B43","v":"IT3"},{"$f":"IF(EingabeAngabe!C43=\"\",\"\",EingabeAngabe!C43)","v":""},null,null,null,{"$f":"IF(N4>EingabeAngabe!F43,\"F\",IF(EingabeAngabe!F43=\"\",\"\",EingabeAngabe!F43))","v":2}]
[null,{"$f":"IF(EingabeAngabe!C9=\"\",\"\",EingabeAngabe!C9)","v":""},null,null,null,null,null,{"$f":"EingabeAngabe!B44","v":"IT4"},{"$f":"IF(EingabeAngabe!C44=\"\",\"\",EingabeAngabe!C44)","v":""},null,null,null,{"$f":"IF(N5>EingabeAngabe!F44,\"F\",IF(EingabeAngabe!F44=\"\",\"\",EingabeAngabe!F44))","v":2}]
[{"$f":"EingabeAngabe!B10","v":"SE3"},{"$f":"IF(EingabeAngabe!C10=\"\",\"\",EingabeAngabe!C10)","v":""},null,null,null,{"$f":"IF(OR(G6=\"\",G6>EingabeAngabe!F10),\"F\",EingabeAngabe!B10)","v":"F"},null,{"$f":"EingabeAngabe!B45","v":"IT5"},{"$f":"IF(EingabeAngabe!C45=\"\",\"\",EingabeAngabe!C45)","v":""},null,null,null,{"$f":"IF(N6>EingabeAngabe!F45,\"F\",IF(EingabeAngabe!F45=\"\",\"\",EingabeAngabe!F45))","v":2}]
[null,{"$f":"IF(EingabeAngabe!C11=\"\",\"\",EingabeAngabe!C11)","v":""},null,null,null,null,null,{"$f":"EingabeAngabe!B46","v":"IT6"},{"$f":"IF(EingabeAngabe!C46=\"\",\"\",EingabeAngabe!C46)","v":""},null,null,null,{"$f":"IF(N7>EingabeAngabe!F46,\"F\",IF(EingabeAngabe!F46=\"\",\"\",EingabeAngabe!F46))","v":2}]
[{"$f":"EingabeAngabe!B12","v":"SE4"},{"$f":"IF(EingabeAngabe!C12=\"\",\"\",EingabeAngabe!C12)","v":""},null,null,null,{"$f":"IF(OR(G8=\"\",G8>EingabeAngabe!F12),\"F\",EingabeAngabe!B12)","v":"F"},null,"Notenschlüssel:"]
[null,{"$f":"IF(EingabeAngabe!C13=\"\",\"\",EingabeAngabe!C13)","v":""},null,null,null,null,null,"Sehr gut",null,null,null,{"$f":"EingabeAngabe!F50","v":"40 - 36"}]
[{"$f":"EingabeAngabe!B14","v":"SE5"},{"$f":"IF(EingabeAngabe!C14=\"\",\"\",EingabeAngabe!C14)","v":""},null,null,null,{"$f":"IF(OR(G10=\"\",G10>EingabeAngabe!F14),\"F\",EingabeAngabe!B14)","v":"F"},null,"Gut",null,null,null,{"$f":"EingabeAngabe!F51","v":"35 - 31"}]
[null,{"$f":"IF(EingabeAngabe!C15=\"\",\"\",EingabeAngabe!C15)","v":""},null,null,null,null,null,"Befriedigend",null,null,null,{"$f":"EingabeAngabe!F52","v":"30 - 26"}]
[{"$f":"EingabeAngabe!B16","v":"SE6"},{"$f":"IF(EingabeAngabe!C16=\"\",\"\",EingabeAngabe!C16)","v":""},null,null,null,{"$f":"IF(OR(G12=\"\",G12>EingabeAngabe!F16),\"F\",EingabeAngabe!B16)","v":"F"},null,"Genügend",null,null,null,{"$f":"EingabeAngabe!F53","v":"25 - 20"}]
[null,{"$f":"IF(EingabeAngabe!C17=\"\",\"\",EingabeAngabe!C17)","v":""},null,null,null,null,null,"Nicht genügend",null,null,null,{"$f":"EingabeAngabe!F54","v":"19 - 00"}]
[{"$f":"EingabeAngabe!B18","v":"SE7"},{"$f":"IF(EingabeAngabe!C18=\"\",\"\",EingabeAngabe!C18)","v":""},null,null,null,{"$f":"IF(OR(G14=\"\",G14>EingabeAngabe!F18),\"F\",EingabeAngabe!B18)","v":"F"},null,{"$f":"CONCATENATE(\"Notendefinition laut LBVO$14:\",\"            \",K31)","v":"Notendefinition laut LBVO$14:            "}]
[null,{"$f":"IF(EingabeAngabe!C19=\"\",\"\",EingabeAngabe!C19)","v":""},null,null,null,null,null,{"$f":"VLOOKUP(K31,SchuelernamenEingabe!D2:'SchuelernamenEingabe'!E40,2,FALSE)","v":{"$error":"#N/A"}}]
[{"$f":"EingabeAngabe!B20","v":"SE8"},{"$f":"IF(EingabeAngabe!C20=\"\",\"\",EingabeAngabe!C20)","v":""},null,null,null,{"$f":"IF(OR(G16=\"\",G16>EingabeAngabe!F20),\"F\",EingabeAngabe!B20)","v":"F"}]
[null,{"$f":"IF(EingabeAngabe!C21=\"\",\"\",EingabeAngabe!C21)","v":""}]
[{"$f":"EingabeAngabe!B23","v":"LE13"},{"$f":"IF(EingabeAngabe!C23=\"\",\"\",EingabeAngabe!C23)","v":""},null,{"$f":"IF(EingabeAngabe!D23=\"\",\"\",EingabeAngabe!D23)","v":""},{"$f":"IF(EingabeAngabe!E23=\"\",\"\",EingabeAngabe!E23)","v":""},{"$f":"IF(OR(G18=\"\",G18>EingabeAngabe!F23),\"F\",EingabeAngabe!B23)","v":"F"}]
[{"$f":"EingabeAngabe!B24","v":"LE14"},{"$f":"IF(EingabeAngabe!C24=\"\",\"\",EingabeAngabe!C24)","v":""},null,{"$f":"IF(EingabeAngabe!D24=\"\",\"\",EingabeAngabe!D24)","v":""},{"$f":"IF(EingabeAngabe!E24=\"\",\"\",EingabeAngabe!E24)","v":""},{"$f":"IF(OR(G19=\"\",G19>EingabeAngabe!F24),\"F\",EingabeAngabe!B24)","v":"F"}]
[{"$f":"EingabeAngabe!B25","v":"LE15"},{"$f":"IF(EingabeAngabe!C25=\"\",\"\",EingabeAngabe!C25)","v":""},null,{"$f":"IF(EingabeAngabe!D25=\"\",\"\",EingabeAngabe!D25)","v":""},{"$f":"IF(EingabeAngabe!E25=\"\",\"\",EingabeAngabe!E25)","v":""},{"$f":"IF(OR(G20=\"\",G20>EingabeAngabe!F25),\"F\",EingabeAngabe!B25)","v":"F"}]
[{"$f":"EingabeAngabe!B26","v":"LE16"},{"$f":"IF(EingabeAngabe!C26=\"\",\"\",EingabeAngabe!C26)","v":""},null,{"$f":"IF(EingabeAngabe!D26=\"\",\"\",EingabeAngabe!D26)","v":""},{"$f":"IF(EingabeAngabe!E26=\"\",\"\",EingabeAngabe!E26)","v":""},{"$f":"IF(OR(G21=\"\",G21>EingabeAngabe!F26),\"F\",EingabeAngabe!B26)","v":"F"}]
[{"$f":"EingabeAngabe!B28","v":"MO19"},{"$f":"IF(EingabeAngabe!C28=\"\",\"\",EingabeAngabe!C28)","v":""},null,{"$f":"IF(EingabeAngabe!D28=\"\",\"\",EingabeAngabe!D28)","v":""},null,{"$f":"IF(OR(G22=\"\",G22>EingabeAngabe!F27),\"F\",EingabeAngabe!B28)","v":"F"}]
[{"$f":"EingabeAngabe!B29","v":"MO20"},{"$f":"IF(EingabeAngabe!C29=\"\",\"\",EingabeAngabe!C29)","v":""},null,{"$f":"IF(EingabeAngabe!D29=\"\",\"\",EingabeAngabe!D29)","v":""},null,{"$f":"IF(OR(G23=\"\",G23>EingabeAngabe!F28),\"F\",EingabeAngabe!B29)","v":"F"},null,{"$f":"IF(EingabeAngabe!F60>\"\",EingabeAngabe!E59,\"\")","v":"Eigener Notenkommentar:"}]
[{"$f":"EingabeAngabe!B30","v":"MO21"},{"$f":"IF(EingabeAngabe!C30=\"\",\"\",EingabeAngabe!C30)","v":""},null,{"$f":"IF(EingabeAngabe!D30=\"\",\"\",EingabeAngabe!D30)","v":""},null,{"$f":"IF(OR(G24=\"\",G24>EingabeAngabe!F29),\"F\",EingabeAngabe!B30)","v":"F"}]
[{"$f":"EingabeAngabe!B31","v":"MO22"},{"$f":"IF(EingabeAngabe!C31=\"\",\"\",EingabeAngabe!C31)","v":""},null,{"$f":"IF(EingabeAngabe!D31=\"\",\"\",EingabeAngabe!D31)","v":""},null,{"$f":"IF(OR(G25=\"\",G25>EingabeAngabe!F30),\"F\",EingabeAngabe!B31)","v":"F"}]
[{"$f":"EingabeAngabe!B33","v":"SY25"},{"$f":"IF(EingabeAngabe!C33=\"\",\"\",EingabeAngabe!C33)","v":""},null,{"$f":"IF(EingabeAngabe!D33=\"\",\"\",EingabeAngabe!D33)","v":""},null,{"$f":"IF(OR(G26=\"\",G26>EingabeAngabe!F31),\"F\",EingabeAngabe!B33)","v":"F"}]
[{"$f":"EingabeAngabe!B34","v":"SY26"},{"$f":"IF(EingabeAngabe!C34=\"\",\"\",EingabeAngabe!C34)","v":""},null,{"$f":"IF(EingabeAngabe!D34=\"\",\"\",EingabeAngabe!D34)","v":""},null,{"$f":"IF(OR(G27=\"\",G27>EingabeAngabe!F32),\"F\",EingabeAngabe!B34)","v":"F"}]
[{"$f":"EingabeAngabe!B35","v":"SY27"},{"$f":"IF(EingabeAngabe!C35=\"\",\"\",EingabeAngabe!C35)","v":""},null,{"$f":"IF(EingabeAngabe!D35=\"\",\"\",EingabeAngabe!D35)","v":""},null,{"$f":"IF(OR(G28=\"\",G28>EingabeAngabe!F33),\"F\",EingabeAngabe!B35)","v":"F"},null,"Summe Übersetzungstext",null,null,null,null,{"$f":"EingabeAngabe!J39","v":""}]
[{"$f":"EingabeAngabe!B36","v":"SY28"},{"$f":"IF(EingabeAngabe!C36=\"\",\"\",EingabeAngabe!C36)","v":""},null,{"$f":"IF(EingabeAngabe!D36=\"\",\"\",EingabeAngabe!D36)","v":""},null,{"$f":"IF(OR(G29=\"\",G29>EingabeAngabe!F34),\"F\",EingabeAngabe!B36)","v":"F"},null,"Summe Arbeitsaufgaben und Interpretation",null,null,null,null,{"$f":"EingabeAngabe!J40","v":""}]
[null,{"$f":"EingabeAngabe!C37","v":"SPRACHLICHE QUALITÄT IN DER ZIELSPRACHE"},null,null,null,{"$f":"IF(OR(G30=1,G30=3,G30=5,G30>5),\"F\",\"4/2/0\")","v":"4/2/0"},null,"Gesamtsumme",null,null,null,null,{"$f":"EingabeAngabe!J2","v":""}]
[null,null,null,null,null,null,null,"NOTE",null,null,{"$f":"IF(EingabeAngabe!J3=1,\"Sehr gut\",IF(EingabeAngabe!J3=2,\"Gut\",IF(EingabeAngabe!J3=3,\"Befriedigend\",IF(EingabeAngabe!J3=4,\"Genügend\",IF(EingabeAngabe!J3=5,\"Nicht genügend\",\"\")))))","v":""}]

{"sheet":"Schueler5Punkte","index":8,"n_rows":31,"n_cols":13,"rows_kept":31,"cut":false,"hidden":false,"merged":[[28,1,28,2],[29,1,29,3],[29,7,29,11],[29,12,29,13],[30,7,30,9],[30,10,30,13],[27,7,27,11],[27,12,27,13],[28,3,28,4],[28,7,28,11],[28,12,28,13],[22,7,22,10],[23,1,23,2],[23,3,23,4],[23,7,26,13],[24,1,24,2],[24,3,24,4],[25,3,25,4],[26,3,26,4],[22,1,22,2],[22,3,22,4],[25,1,25,2],[26,1,26,2],[27,1,27,2],[27,3,27,4],[15,0,16,0],[15,1,15,4],[15,5,16,5],[15,6,16,6],[16,1,16,4],[13,7,13,13],[14,7,21,13],[17,1,17,2],[18,1,18,2],[19,1,19,2],[20,1,20,2],[21,1,21,2],[21,3,21,4],[13,0,14,0],[13,1,13,4],[13,5,14,5],[13,6,14,6],[14,1,14,4],[10,11,10,13],[11,7,11,10],[11,11,11,13],[12,7,12,10],[12,11,12,13],[7,7,7,13],[8,7,8,10],[8,11,8,13],[11,0,12,0],[11,1,11,4],[11,5,12,5],[11,6,12,6],[12,1,12,4],[9,0,10,0],[9,1,9,4],[9,5,10,5],[9,6,10,6],[10,1,10,4],[9,7,9,10],[9,11,9,13],[10,7,10,10],[5,0,6,0],[5,1,5,4],[5,5,6,5],[5,6,6,6],[5,8,5,11],[6,1,6,4],[6,8,6,11],[7,0,8,0],[7,1,7,4],[7,5,8,5],[7,6,8,6],[8,1,8,4],[0,0,0,1],[0,3,0,4],[0,7,0,11],[1,0,2,0],[1,1,1,4],[1,5,2,5],[1,6,2,6],[1,8,1,11],[2,1,2,4],[2,8,2,11],[3,0,4,0],[3,1,3,4],[3,5,4,5],[3,6,4,6],[3,8,3,11],[4,1,4,4],[4,8,4,11]]}
["Übersetzungstext",null,"Schülername",{"$f":"SchuelernamenEingabe!B6","v":0},null,null,null,"Arbeitsaufgaben/ Interpretation"]
[{"$f":"EingabeAngabe!B6","v":"SE1"},{"$f":"IF(EingabeAngabe!C6=\"\",\"\",EingabeAngabe!C6)","v":""},null,null,null,{"$f":"IF(OR(G2=\"\",G2>EingabeAngabe!F6),\"F\",EingabeAngabe!B6)","v":"F"},null,{"$f":"EingabeAngabe!B41","v":"IT1"},{"$f":"IF(EingabeAngabe!C41=\"\",\"\",EingabeAngabe!C41)","v":""},null,null,null,{"$f":"IF(N2>EingabeAngabe!F41,\"F\",IF(EingabeAngabe!F41=\"\",\"\",EingabeAngabe!F41))","v":4}]
[null,{"$f":"IF(EingabeAngabe!C7=\"\",\"\",EingabeAngabe!C7)","v":""},null,null,null,null,null,{"$f":"EingabeAngabe!B42","v":"IT2"},{"$f":"IF(EingabeAngabe!C42=\"\",\"\",EingabeAngabe!C42)","v":""},null,null,null,{"$f":"IF(N3>EingabeAngabe!F42,\"F\",IF(EingabeAngabe!F42=\"\",\"\",EingabeAngabe!F42))","v":4}]
[{"$f":"EingabeAngabe!B8","v":"SE2"},{"$f":"IF(EingabeAngabe!C8=\"\",\"\",EingabeAngabe!C8)","v":""},null,null,null,{"$f":"IF(OR(G4=\"\",G4>EingabeAngabe!F8),\"F\",EingabeAngabe!B8)","v":"F"},null,{"$f":"EingabeAngabe!B43","v":"IT3"},{"$f":"IF(EingabeAngabe!C43=\"\",\"\",EingabeAngabe!C43)","v":""},null,null,null,{"$f":"IF(N4>EingabeAngabe!F43,\"F\",IF(EingabeAngabe!F43=\"\",\"\",EingabeAngabe!F43))","v":2}]
[null,{"$f":"IF(EingabeAngabe!C9=\"\",\"\",EingabeAngabe!C9)","v":""},null,null,null,null,null,{"$f":"EingabeAngabe!B44","v":"IT4"},{"$f":"IF(EingabeAngabe!C44=\"\",\"\",EingabeAngabe!C44)","v":""},null,null,null,{"$f":"IF(N5>EingabeAngabe!F44,\"F\",IF(EingabeAngabe!F44=\"\",\"\",EingabeAngabe!F44))","v":2}]
[{"$f":"EingabeAngabe!B10","v":"SE3"},{"$f":"IF(EingabeAngabe!C10=\"\",\"\",EingabeAngabe!C10)","v":""},null,null,null,{"$f":"IF(OR(G6=\"\",G6>EingabeAngabe!F10),\"F\",EingabeAngabe!B10)","v":"F"},null,{"$f":"EingabeAngabe!B45","v":"IT5"},{"$f":"IF(EingabeAngabe!C45=\"\",\"\",EingabeAngabe!C45)","v":""},null,null,null,{"$f":"IF(N6>EingabeAngabe!F45,\"F\",IF(EingabeAngabe!F45=\"\",\"\",EingabeAngabe!F45))","v":2}]
[null,{"$f":"IF(EingabeAngabe!C11=\"\",\"\",EingabeAngabe!C11)","v":""},null,null,null,null,null,{"$f":"EingabeAngabe!B46","v":"IT6"},{"$f":"IF(EingabeAngabe!C46=\"\",\"\",EingabeAngabe!C46)","v":""},null,null,null,{"$f":"IF(N7>EingabeAngabe!F46,\"F\",IF(EingabeAngabe!F46=\"\",\"\",EingabeAngabe!F46))","v":2}]
[{"$f":"EingabeAngabe!B12","v":"SE4"},{"$f":"IF(EingabeAngabe!C12=\"\",\"\",EingabeAngabe!C12)","v":""},null,null,null,{"$f":"IF(OR(G8=\"\",G8>EingabeAngabe!F12),\"F\",EingabeAngabe!B12)","v":"F"},null,"Notenschlüssel:"]
[null,{"$f":"IF(EingabeAngabe!C13=\"\",\"\",EingabeAngabe!C13)","v":""},null,null,null,null,null,"Sehr gut",null,null,null,{"$f":"EingabeAngabe!F50","v":"40 - 36"}]
[{"$f":"EingabeAngabe!B14","v":"SE5"},{"$f":"IF(EingabeAngabe!C14=\"\",\"\",EingabeAngabe!C14)","v":""},null,null,null,{"$f":"IF(OR(G10=\"\",G10>EingabeAngabe!F14),\"F\",EingabeAngabe!B14)","v":"F"},null,"Gut",null,null,null,{"$f":"EingabeAngabe!F51","v":"35 - 31"}]
[null,{"$f":"IF(EingabeAngabe!C15=\"\",\"\",EingabeAngabe!C15)","v":""},null,null,null,null,null,"Befriedigend",null,null,null,{"$f":"EingabeAngabe!F52","v":"30 - 26"}]
[{"$f":"EingabeAngabe!B16","v":"SE6"},{"$f":"IF(EingabeAngabe!C16=\"\",\"\",EingabeAngabe!C16)","v":""},null,null,null,{"$f":"IF(OR(G12=\"\",G12>EingabeAngabe!F16),\"F\",EingabeAngabe!B16)","v":"F"},null,"Genügend",null,null,null,{"$f":"EingabeAngabe!F53","v":"25 - 20"}]
[null,{"$f":"IF(EingabeAngabe!C17=\"\",\"\",EingabeAngabe!C17)","v":""},null,null,null,null,null,"Nicht genügend",null,null,null,{"$f":"EingabeAngabe!F54","v":"19 - 00"}]
[{"$f":"EingabeAngabe!B18","v":"SE7"},{"$f":"IF(EingabeAngabe!C18=\"\",\"\",EingabeAngabe!C18)","v":""},null,null,null,{"$f":"IF(OR(G14=\"\",G14>EingabeAngabe!F18),\"F\",EingabeAngabe!B18)","v":"F"},null,{"$f":"CONCATENATE(\"Notendefinition laut LBVO$14:\",\"            \",K31)","v":"Notendefinition laut LBVO$14:            "}]
[null,{"$f":"IF(EingabeAngabe!C19=\"\",\"\",EingabeAngabe!C19)","v":""},null,null,null,null,null,{"$f":"VLOOKUP(K31,SchuelernamenEingabe!D2:'SchuelernamenEingabe'!E40,2,FALSE)","v":{"$error":"#N/A"}}]
[{"$f":"EingabeAngabe!B20","v":"SE8"},{"$f":"IF(EingabeAngabe!C20=\"\",\"\",EingabeAngabe!C20)","v":""},null,null,null,{"$f":"IF(OR(G16=\"\",G16>EingabeAngabe!F20),\"F\",EingabeAngabe!B20)","v":"F"}]
[null,{"$f":"IF(EingabeAngabe!C21=\"\",\"\",EingabeAngabe!C21)","v":""}]
[{"$f":"EingabeAngabe!B23","v":"LE13"},{"$f":"IF(EingabeAngabe!C23=\"\",\"\",EingabeAngabe!C23)","v":""},null,{"$f":"IF(EingabeAngabe!D23=\"\",\"\",EingabeAngabe!D23)","v":""},{"$f":"IF(EingabeAngabe!E23=\"\",\"\",EingabeAngabe!E23)","v":""},{"$f":"IF(OR(G18=\"\",G18>EingabeAngabe!F23),\"F\",EingabeAngabe!B23)","v":"F"}]
[{"$f":"EingabeAngabe!B24","v":"LE14"},{"$f":"IF(EingabeAngabe!C24=\"\",\"\",EingabeAngabe!C24)","v":""},null,{"$f":"IF(EingabeAngabe!D24=\"\",\"\",EingabeAngabe!D24)","v":""},{"$f":"IF(EingabeAngabe!E24=\"\",\"\",EingabeAngabe!E24)","v":""},{"$f":"IF(OR(G19=\"\",G19>EingabeAngabe!F24),\"F\",EingabeAngabe!B24)","v":"F"}]
[{"$f":"EingabeAngabe!B25","v":"LE15"},{"$f":"IF(EingabeAngabe!C25=\"\",\"\",EingabeAngabe!C25)","v":""},null,{"$f":"IF(EingabeAngabe!D25=\"\",\"\",EingabeAngabe!D25)","v":""},{"$f":"IF(EingabeAngabe!E25=\"\",\"\",EingabeAngabe!E25)","v":""},{"$f":"IF(OR(G20=\"\",G20>EingabeAngabe!F25),\"F\",EingabeAngabe!B25)","v":"F"}]
[{"$f":"EingabeAngabe!B26","v":"LE16"},{"$f":"IF(EingabeAngabe!C26=\"\",\"\",EingabeAngabe!C26)","v":""},null,{"$f":"IF(EingabeAngabe!D26=\"\",\"\",EingabeAngabe!D26)","v":""},{"$f":"IF(EingabeAngabe!E26=\"\",\"\",EingabeAngabe!E26)","v":""},{"$f":"IF(OR(G21=\"\",G21>EingabeAngabe!F26),\"F\",EingabeAngabe!B26)","v":"F"}]
[{"$f":"EingabeAngabe!B28","v":"MO19"},{"$f":"IF(EingabeAngabe!C28=\"\",\"\",EingabeAngabe!C28)","v":""},null,{"$f":"IF(EingabeAngabe!D28=\"\",\"\",EingabeAngabe!D28)","v":""},null,{"$f":"IF(OR(G22=\"\",G22>EingabeAngabe!F27),\"F\",EingabeAngabe!B28)","v":"F"}]
[{"$f":"EingabeAngabe!B29","v":"MO20"},{"$f":"IF(EingabeAngabe!C29=\"\",\"\",EingabeAngabe!C29)","v":""},null,{"$f":"IF(EingabeAngabe!D29=\"\",\"\",EingabeAngabe!D29)","v":""},null,{"$f":"IF(OR(G23=\"\",G23>EingabeAngabe!F28),\"F\",EingabeAngabe!B29)","v":"F"},null,{"$f":"IF(EingabeAngabe!F60>\"\",EingabeAngabe!E59,\"\")","v":"Eigener Notenkommentar:"}]
[{"$f":"EingabeAngabe!B30","v":"MO21"},{"$f":"IF(EingabeAngabe!C30=\"\",\"\",EingabeAngabe!C30)","v":""},null,{"$f":"IF(EingabeAngabe!D30=\"\",\"\",EingabeAngabe!D30)","v":""},null,{"$f":"IF(OR(G24=\"\",G24>EingabeAngabe!F29),\"F\",EingabeAngabe!B30)","v":"F"}]
[{"$f":"EingabeAngabe!B31","v":"MO22"},{"$f":"IF(EingabeAngabe!C31=\"\",\"\",EingabeAngabe!C31)","v":""},null,{"$f":"IF(EingabeAngabe!D31=\"\",\"\",EingabeAngabe!D31)","v":""},null,{"$f":"IF(OR(G25=\"\",G25>EingabeAngabe!F30),\"F\",EingabeAngabe!B31)","v":"F"}]
[{"$f":"EingabeAngabe!B33","v":"SY25"},{"$f":"IF(EingabeAngabe!C33=\"\",\"\",EingabeAngabe!C33)","v":""},null,{"$f":"IF(EingabeAngabe!D33=\"\",\"\",EingabeAngabe!D33)","v":""},null,{"$f":"IF(OR(G26=\"\",G26>EingabeAngabe!F31),\"F\",EingabeAngabe!B33)","v":"F"}]
[{"$f":"EingabeAngabe!B34","v":"SY26"},{"$f":"IF(EingabeAngabe!C34=\"\",\"\",EingabeAngabe!C34)","v":""},null,{"$f":"IF(EingabeAngabe!D34=\"\",\"\",EingabeAngabe!D34)","v":""},null,{"$f":"IF(OR(G27=\"\",G27>EingabeAngabe!F32),\"F\",EingabeAngabe!B34)","v":"F"}]
[{"$f":"EingabeAngabe!B35","v":"SY27"},{"$f":"IF(EingabeAngabe!C35=\"\",\"\",EingabeAngabe!C35)","v":""},null,{"$f":"IF(EingabeAngabe!D35=\"\",\"\",EingabeAngabe!D35)","v":""},null,{"$f":"IF(OR(G28=\"\",G28>EingabeAngabe!F33),\"F\",EingabeAngabe!B35)","v":"F"},null,"Summe Übersetzungstext",null,null,null,null,{"$f":"EingabeAngabe!K39","v":""}]
[{"$f":"EingabeAngabe!B36","v":"SY28"},{"$f":"IF(EingabeAngabe!C36=\"\",\"\",EingabeAngabe!C36)","v":""},null,{"$f":"IF(EingabeAngabe!D36=\"\",\"\",EingabeAngabe!D36)","v":""},null,{"$f":"IF(OR(G29=\"\",G29>EingabeAngabe!F34),\"F\",EingabeAngabe!B36)","v":"F"},null,"Summe Arbeitsaufgaben und Interpretation",null,null,null,null,{"$f":"EingabeAngabe!K40","v":""}]
[null,{"$f":"EingabeAngabe!C37","v":"SPRACHLICHE QUALITÄT IN DER ZIELSPRACHE"},null,null,null,{"$f":"IF(OR(G30=1,G30=3,G30=5,G30>5),\"F\",\"4/2/0\")","v":"4/2/0"},null,"Gesamtsumme",null,null,null,null,{"$f":"EingabeAngabe!K2","v":""}]
[null,null,null,null,null,null,null,"NOTE",null,null,{"$f":"IF(EingabeAngabe!K3=1,\"Sehr gut\",IF(EingabeAngabe!K3=2,\"Gut\",IF(EingabeAngabe!K3=3,\"Befriedigend\",IF(EingabeAngabe!K3=4,\"Genügend\",IF(EingabeAngabe!K3=5,\"Nicht genügend\",\"\")))))","v":""}]

{"sheet":"Schueler6Punkte","index":9,"n_rows":31,"n_cols":13,"rows_kept":31,"cut":false,"hidden":false,"merged":[[28,1,28,2],[29,1,29,3],[29,7,29,11],[29,12,29,13],[30,7,30,9],[30,10,30,13],[27,7,27,11],[27,12,27,13],[28,3,28,4],[28,7,28,11],[28,12,28,13],[22,7,22,10],[23,1,23,2],[23,3,23,4],[23,7,26,13],[24,1,24,2],[24,3,24,4],[25,3,25,4],[26,3,26,4],[22,1,22,2],[22,3,22,4],[25,1,25,2],[26,1,26,2],[27,1,27,2],[27,3,27,4],[15,0,16,0],[15,1,15,4],[15,5,16,5],[15,6,16,6],[16,1,16,4],[13,7,13,13],[14,7,21,13],[17,1,17,2],[18,1,18,2],[19,1,19,2],[20,1,20,2],[21,1,21,2],[21,3,21,4],[13,0,14,0],[13,1,13,4],[13,5,14,5],[13,6,14,6],[14,1,14,4],[10,11,10,13],[11,7,11,10],[11,11,11,13],[12,7,12,10],[12,11,12,13],[7,7,7,13],[8,7,8,10],[8,11,8,13],[11,0,12,0],[11,1,11,4],[11,5,12,5],[11,6,12,6],[12,1,12,4],[9,0,10,0],[9,1,9,4],[9,5,10,5],[9,6,10,6],[10,1,10,4],[9,7,9,10],[9,11,9,13],[10,7,10,10],[5,0,6,0],[5,1,5,4],[5,5,6,5],[5,6,6,6],[5,8,5,11],[6,1,6,4],[6,8,6,11],[7,0,8,0],[7,1,7,4],[7,5,8,5],[7,6,8,6],[8,1,8,4],[0,0,0,1],[0,3,0,4],[0,7,0,11],[1,0,2,0],[1,1,1,4],[1,5,2,5],[1,6,2,6],[1,8,1,11],[2,1,2,4],[2,8,2,11],[3,0,4,0],[3,1,3,4],[3,5,4,5],[3,6,4,6],[3,8,3,11],[4,1,4,4],[4,8,4,11]]}
["Übersetzungstext",null,"Schülername",{"$f":"SchuelernamenEingabe!B7","v":0},null,null,null,"Arbeitsaufgaben/ Interpretation"]
[{"$f":"EingabeAngabe!B6","v":"SE1"},{"$f":"IF(EingabeAngabe!C6=\"\",\"\",EingabeAngabe!C6)","v":""},null,null,null,{"$f":"IF(OR(G2=\"\",G2>EingabeAngabe!F6),\"F\",EingabeAngabe!B6)","v":"F"},null,{"$f":"EingabeAngabe!B41","v":"IT1"},{"$f":"IF(EingabeAngabe!C41=\"\",\"\",EingabeAngabe!C41)","v":""},null,null,null,{"$f":"IF(N2>EingabeAngabe!F41,\"F\",IF(EingabeAngabe!F41=\"\",\"\",EingabeAngabe!F41))","v":4}]
[null,{"$f":"IF(EingabeAngabe!C7=\"\",\"\",EingabeAngabe!C7)","v":""},null,null,null,null,null,{"$f":"EingabeAngabe!B42","v":"IT2"},{"$f":"IF(EingabeAngabe!C42=\"\",\"\",EingabeAngabe!C42)","v":""},null,null,null,{"$f":"IF(N3>EingabeAngabe!F42,\"F\",IF(EingabeAngabe!F42=\"\",\"\",EingabeAngabe!F42))","v":4}]
[{"$f":"EingabeAngabe!B8","v":"SE2"},{"$f":"IF(EingabeAngabe!C8=\"\",\"\",EingabeAngabe!C8)","v":""},null,null,null,{"$f":"IF(OR(G4=\"\",G4>EingabeAngabe!F8),\"F\",EingabeAngabe!B8)","v":"F"},null,{"$f":"EingabeAngabe!B43","v":"IT3"},{"$f":"IF(EingabeAngabe!C43=\"\",\"\",EingabeAngabe!C43)","v":""},null,null,null,{"$f":"IF(N4>EingabeAngabe!F43,\"F\",IF(EingabeAngabe!F43=\"\",\"\",EingabeAngabe!F43))","v":2}]
[null,{"$f":"IF(EingabeAngabe!C9=\"\",\"\",EingabeAngabe!C9)","v":""},null,null,null,null,null,{"$f":"EingabeAngabe!B44","v":"IT4"},{"$f":"IF(EingabeAngabe!C44=\"\",\"\",EingabeAngabe!C44)","v":""},null,null,null,{"$f":"IF(N5>EingabeAngabe!F44,\"F\",IF(EingabeAngabe!F44=\"\",\"\",EingabeAngabe!F44))","v":2}]
[{"$f":"EingabeAngabe!B10","v":"SE3"},{"$f":"IF(EingabeAngabe!C10=\"\",\"\",EingabeAngabe!C10)","v":""},null,null,null,{"$f":"IF(OR(G6=\"\",G6>EingabeAngabe!F10),\"F\",EingabeAngabe!B10)","v":"F"},null,{"$f":"EingabeAngabe!B45","v":"IT5"},{"$f":"IF(EingabeAngabe!C45=\"\",\"\",EingabeAngabe!C45)","v":""},null,null,null,{"$f":"IF(N6>EingabeAngabe!F45,\"F\",IF(EingabeAngabe!F45=\"\",\"\",EingabeAngabe!F45))","v":2}]
[null,{"$f":"IF(EingabeAngabe!C11=\"\",\"\",EingabeAngabe!C11)","v":""},null,null,null,null,null,{"$f":"EingabeAngabe!B46","v":"IT6"},{"$f":"IF(EingabeAngabe!C46=\"\",\"\",EingabeAngabe!C46)","v":""},null,null,null,{"$f":"IF(N7>EingabeAngabe!F46,\"F\",IF(EingabeAngabe!F46=\"\",\"\",EingabeAngabe!F46))","v":2}]
[{"$f":"EingabeAngabe!B12","v":"SE4"},{"$f":"IF(EingabeAngabe!C12=\"\",\"\",EingabeAngabe!C12)","v":""},null,null,null,{"$f":"IF(OR(G8=\"\",G8>EingabeAngabe!F12),\"F\",EingabeAngabe!B12)","v":"F"},null,"Notenschlüssel:"]
[null,{"$f":"IF(EingabeAngabe!C13=\"\",\"\",EingabeAngabe!C13)","v":""},null,null,null,null,null,"Sehr gut",null,null,null,{"$f":"EingabeAngabe!F50","v":"40 - 36"}]
[{"$f":"EingabeAngabe!B14","v":"SE5"},{"$f":"IF(EingabeAngabe!C14=\"\",\"\",EingabeAngabe!C14)","v":""},null,null,null,{"$f":"IF(OR(G10=\"\",G10>EingabeAngabe!F14),\"F\",EingabeAngabe!B14)","v":"F"},null,"Gut",null,null,null,{"$f":"EingabeAngabe!F51","v":"35 - 31"}]
[null,{"$f":"IF(EingabeAngabe!C15=\"\",\"\",EingabeAngabe!C15)","v":""},null,null,null,null,null,"Befriedigend",null,null,null,{"$f":"EingabeAngabe!F52","v":"30 - 26"}]
[{"$f":"EingabeAngabe!B16","v":"SE6"},{"$f":"IF(EingabeAngabe!C16=\"\",\"\",EingabeAngabe!C16)","v":""},null,null,null,{"$f":"IF(OR(G12=\"\",G12>EingabeAngabe!F16),\"F\",EingabeAngabe!B16)","v":"F"},null,"Genügend",null,null,null,{"$f":"EingabeAngabe!F53","v":"25 - 20"}]
[null,{"$f":"IF(EingabeAngabe!C17=\"\",\"\",EingabeAngabe!C17)","v":""},null,null,null,null,null,"Nicht genügend",null,null,null,{"$f":"EingabeAngabe!F54","v":"19 - 00"}]
[{"$f":"EingabeAngabe!B18","v":"SE7"},{"$f":"IF(EingabeAngabe!C18=\"\",\"\",EingabeAngabe!C18)","v":""},null,null,null,{"$f":"IF(OR(G14=\"\",G14>EingabeAngabe!F18),\"F\",EingabeAngabe!B18)","v":"F"},null,{"$f":"CONCATENATE(\"Notendefinition laut LBVO$14:\",\"            \",K31)","v":"Notendefinition laut LBVO$14:            "}]
[null,{"$f":"IF(EingabeAngabe!C19=\"\",\"\",EingabeAngabe!C19)","v":""},null,null,null,null,null,{"$f":"VLOOKUP(K31,SchuelernamenEingabe!D2:'SchuelernamenEingabe'!E40,2,FALSE)","v":{"$error":"#N/A"}}]
[{"$f":"EingabeAngabe!B20","v":"SE8"},{"$f":"IF(EingabeAngabe!C20=\"\",\"\",EingabeAngabe!C20)","v":""},null,null,null,{"$f":"IF(OR(G16=\"\",G16>EingabeAngabe!F20),\"F\",EingabeAngabe!B20)","v":"F"}]
[null,{"$f":"IF(EingabeAngabe!C21=\"\",\"\",EingabeAngabe!C21)","v":""}]
[{"$f":"EingabeAngabe!B23","v":"LE13"},{"$f":"IF(EingabeAngabe!C23=\"\",\"\",EingabeAngabe!C23)","v":""},null,{"$f":"IF(EingabeAngabe!D23=\"\",\"\",EingabeAngabe!D23)","v":""},{"$f":"IF(EingabeAngabe!E23=\"\",\"\",EingabeAngabe!E23)","v":""},{"$f":"IF(OR(G18=\"\",G18>EingabeAngabe!F23),\"F\",EingabeAngabe!B23)","v":"F"}]
[{"$f":"EingabeAngabe!B24","v":"LE14"},{"$f":"IF(EingabeAngabe!C24=\"\",\"\",EingabeAngabe!C24)","v":""},null,{"$f":"IF(EingabeAngabe!D24=\"\",\"\",EingabeAngabe!D24)","v":""},{"$f":"IF(EingabeAngabe!E24=\"\",\"\",EingabeAngabe!E24)","v":""},{"$f":"IF(OR(G19=\"\",G19>EingabeAngabe!F24),\"F\",EingabeAngabe!B24)","v":"F"}]
[{"$f":"EingabeAngabe!B25","v":"LE15"},{"$f":"IF(EingabeAngabe!C25=\"\",\"\",EingabeAngabe!C25)","v":""},null,{"$f":"IF(EingabeAngabe!D25=\"\",\"\",EingabeAngabe!D25)","v":""},{"$f":"IF(EingabeAngabe!E25=\"\",\"\",EingabeAngabe!E25)","v":""},{"$f":"IF(OR(G20=\"\",G20>EingabeAngabe!F25),\"F\",EingabeAngabe!B25)","v":"F"}]
[{"$f":"EingabeAngabe!B26","v":"LE16"},{"$f":"IF(EingabeAngabe!C26=\"\",\"\",EingabeAngabe!C26)","v":""},null,{"$f":"IF(EingabeAngabe!D26=\"\",\"\",EingabeAngabe!D26)","v":""},{"$f":"IF(EingabeAngabe!E26=\"\",\"\",EingabeAngabe!E26)","v":""},{"$f":"IF(OR(G21=\"\",G21>EingabeAngabe!F26),\"F\",EingabeAngabe!B26)","v":"F"}]
[{"$f":"EingabeAngabe!B28","v":"MO19"},{"$f":"IF(EingabeAngabe!C28=\"\",\"\",EingabeAngabe!C28)","v":""},null,{"$f":"IF(EingabeAngabe!D28=\"\",\"\",EingabeAngabe!D28)","v":""},null,{"$f":"IF(OR(G22=\"\",G22>EingabeAngabe!F27),\"F\",EingabeAngabe!B28)","v":"F"}]
[{"$f":"EingabeAngabe!B29","v":"MO20"},{"$f":"IF(EingabeAngabe!C29=\"\",\"\",EingabeAngabe!C29)","v":""},null,{"$f":"IF(EingabeAngabe!D29=\"\",\"\",EingabeAngabe!D29)","v":""},null,{"$f":"IF(OR(G23=\"\",G23>EingabeAngabe!F28),\"F\",EingabeAngabe!B29)","v":"F"},null,{"$f":"IF(EingabeAngabe!F60>\"\",EingabeAngabe!E59,\"\")","v":"Eigener Notenkommentar:"}]
[{"$f":"EingabeAngabe!B30","v":"MO21"},{"$f":"IF(EingabeAngabe!C30=\"\",\"\",EingabeAngabe!C30)","v":""},null,{"$f":"IF(EingabeAngabe!D30=\"\",\"\",EingabeAngabe!D30)","v":""},null,{"$f":"IF(OR(G24=\"\",G24>EingabeAngabe!F29),\"F\",EingabeAngabe!B30)","v":"F"}]
[{"$f":"EingabeAngabe!B31","v":"MO22"},{"$f":"IF(EingabeAngabe!C31=\"\",\"\",EingabeAngabe!C31)","v":""},null,{"$f":"IF(EingabeAngabe!D31=\"\",\"\",EingabeAngabe!D31)","v":""},null,{"$f":"IF(OR(G25=\"\",G25>EingabeAngabe!F30),\"F\",EingabeAngabe!B31)","v":"F"}]
[{"$f":"EingabeAngabe!B33","v":"SY25"},{"$f":"IF(EingabeAngabe!C33=\"\",\"\",EingabeAngabe!C33)","v":""},null,{"$f":"IF(EingabeAngabe!D33=\"\",\"\",EingabeAngabe!D33)","v":""},null,{"$f":"IF(OR(G26=\"\",G26>EingabeAngabe!F31),\"F\",EingabeAngabe!B33)","v":"F"}]
[{"$f":"EingabeAngabe!B34","v":"SY26"},{"$f":"IF(EingabeAngabe!C34=\"\",\"\",EingabeAngabe!C34)","v":""},null,{"$f":"IF(EingabeAngabe!D34=\"\",\"\",EingabeAngabe!D34)","v":""},null,{"$f":"IF(OR(G27=\"\",G27>EingabeAngabe!F32),\"F\",EingabeAngabe!B34)","v":"F"}]
[{"$f":"EingabeAngabe!B35","v":"SY27"},{"$f":"IF(EingabeAngabe!C35=\"\",\"\",EingabeAngabe!C35)","v":""},null,{"$f":"IF(EingabeAngabe!D35=\"\",\"\",EingabeAngabe!D35)","v":""},null,{"$f":"IF(OR(G28=\"\",G28>EingabeAngabe!F33),\"F\",EingabeAngabe!B35)","v":"F"},null,"Summe Übersetzungstext",null,null,null,null,{"$f":"EingabeAngabe!L39","v":""}]
[{"$f":"EingabeAngabe!B36","v":"SY28"},{"$f":"IF(EingabeAngabe!C36=\"\",\"\",EingabeAngabe!C36)","v":""},null,{"$f":"IF(EingabeAngabe!D36=\"\",\"\",EingabeAngabe!D36)","v":""},null,{"$f":"IF(OR(G29=\"\",G29>EingabeAngabe!F34),\"F\",EingabeAngabe!B36)","v":"F"},null,"Summe Arbeitsaufgaben und Interpretation",null,null,null,null,{"$f":"EingabeAngabe!L40","v":""}]
[null,{"$f":"EingabeAngabe!C37","v":"SPRACHLICHE QUALITÄT IN DER ZIELSPRACHE"},null,null,null,{"$f":"IF(OR(G30=1,G30=3,G30=5,G30>5),\"F\",\"4/2/0\")","v":"4/2/0"},null,"Gesamtsumme",null,null,null,null,{"$f":"EingabeAngabe!L2","v":""}]
[null,null,null,null,null,null,null,"NOTE",null,null,{"$f":"IF(EingabeAngabe!L3=1,\"Sehr gut\",IF(EingabeAngabe!L3=2,\"Gut\",IF(EingabeAngabe!L3=3,\"Befriedigend\",IF(EingabeAngabe!L3=4,\"Genügend\",IF(EingabeAngabe!L3=5,\"Nicht genügend\",\"\")))))","v":""}]

{"sheet":"Schueler7Punkte","index":10,"n_rows":31,"n_cols":13,"rows_kept":31,"cut":false,"hidden":false,"merged":[[28,1,28,2],[29,1,29,3],[29,7,29,11],[29,12,29,13],[30,7,30,9],[30,10,30,13],[27,7,27,11],[27,12,27,13],[28,3,28,4],[28,7,28,11],[28,12,28,13],[22,7,22,10],[23,1,23,2],[23,3,23,4],[23,7,26,13],[24,1,24,2],[24,3,24,4],[25,3,25,4],[26,3,26,4],[22,1,22,2],[22,3,22,4],[25,1,25,2],[26,1,26,2],[27,1,27,2],[27,3,27,4],[15,0,16,0],[15,1,15,4],[15,5,16,5],[15,6,16,6],[16,1,16,4],[13,7,13,13],[14,7,21,13],[17,1,17,2],[18,1,18,2],[19,1,19,2],[20,1,20,2],[21,1,21,2],[21,3,21,4],[13,0,14,0],[13,1,13,4],[13,5,14,5],[13,6,14,6],[14,1,14,4],[10,11,10,13],[11,7,11,10],[11,11,11,13],[12,7,12,10],[12,11,12,13],[7,7,7,13],[8,7,8,10],[8,11,8,13],[11,0,12,0],[11,1,11,4],[11,5,12,5],[11,6,12,6],[12,1,12,4],[9,0,10,0],[9,1,9,4],[9,5,10,5],[9,6,10,6],[10,1,10,4],[9,7,9,10],[9,11,9,13],[10,7,10,10],[5,0,6,0],[5,1,5,4],[5,5,6,5],[5,6,6,6],[5,8,5,11],[6,1,6,4],[6,8,6,11],[7,0,8,0],[7,1,7,4],[7,5,8,5],[7,6,8,6],[8,1,8,4],[0,0,0,1],[0,3,0,4],[0,7,0,11],[1,0,2,0],[1,1,1,4],[1,5,2,5],[1,6,2,6],[1,8,1,11],[2,1,2,4],[2,8,2,11],[3,0,4,0],[3,1,3,4],[3,5,4,5],[3,6,4,6],[3,8,3,11],[4,1,4,4],[4,8,4,11]]}
["Übersetzungstext",null,"Schülername",{"$f":"SchuelernamenEingabe!B8","v":0},null,null,null,"Arbeitsaufgaben/ Interpretation"]
[{"$f":"EingabeAngabe!B6","v":"SE1"},{"$f":"IF(EingabeAngabe!C6=\"\",\"\",EingabeAngabe!C6)","v":""},null,null,null,{"$f":"IF(OR(G2=\"\",G2>EingabeAngabe!F6),\"F\",EingabeAngabe!B6)","v":"F"},null,{"$f":"EingabeAngabe!B41","v":"IT1"},{"$f":"IF(EingabeAngabe!C41=\"\",\"\",EingabeAngabe!C41)","v":""},null,null,null,{"$f":"IF(N2>EingabeAngabe!F41,\"F\",IF(EingabeAngabe!F41=\"\",\"\",EingabeAngabe!F41))","v":4}]
[null,{"$f":"IF(EingabeAngabe!C7=\"\",\"\",EingabeAngabe!C7)","v":""},null,null,null,null,null,{"$f":"EingabeAngabe!B42","v":"IT2"},{"$f":"IF(EingabeAngabe!C42=\"\",\"\",EingabeAngabe!C42)","v":""},null,null,null,{"$f":"IF(N3>EingabeAngabe!F42,\"F\",IF(EingabeAngabe!F42=\"\",\"\",EingabeAngabe!F42))","v":4}]
[{"$f":"EingabeAngabe!B8","v":"SE2"},{"$f":"IF(EingabeAngabe!C8=\"\",\"\",EingabeAngabe!C8)","v":""},null,null,null,{"$f":"IF(OR(G4=\"\",G4>EingabeAngabe!F8),\"F\",EingabeAngabe!B8)","v":"F"},null,{"$f":"EingabeAngabe!B43","v":"IT3"},{"$f":"IF(EingabeAngabe!C43=\"\",\"\",EingabeAngabe!C43)","v":""},null,null,null,{"$f":"IF(N4>EingabeAngabe!F43,\"F\",IF(EingabeAngabe!F43=\"\",\"\",EingabeAngabe!F43))","v":2}]
[null,{"$f":"IF(EingabeAngabe!C9=\"\",\"\",EingabeAngabe!C9)","v":""},null,null,null,null,null,{"$f":"EingabeAngabe!B44","v":"IT4"},{"$f":"IF(EingabeAngabe!C44=\"\",\"\",EingabeAngabe!C44)","v":""},null,null,null,{"$f":"IF(N5>EingabeAngabe!F44,\"F\",IF(EingabeAngabe!F44=\"\",\"\",EingabeAngabe!F44))","v":2}]
[{"$f":"EingabeAngabe!B10","v":"SE3"},{"$f":"IF(EingabeAngabe!C10=\"\",\"\",EingabeAngabe!C10)","v":""},null,null,null,{"$f":"IF(OR(G6=\"\",G6>EingabeAngabe!F10),\"F\",EingabeAngabe!B10)","v":"F"},null,{"$f":"EingabeAngabe!B45","v":"IT5"},{"$f":"IF(EingabeAngabe!C45=\"\",\"\",EingabeAngabe!C45)","v":""},null,null,null,{"$f":"IF(N6>EingabeAngabe!F45,\"F\",IF(EingabeAngabe!F45=\"\",\"\",EingabeAngabe!F45))","v":2}]
[null,{"$f":"IF(EingabeAngabe!C11=\"\",\"\",EingabeAngabe!C11)","v":""},null,null,null,null,null,{"$f":"EingabeAngabe!B46","v":"IT6"},{"$f":"IF(EingabeAngabe!C46=\"\",\"\",EingabeAngabe!C46)","v":""},null,null,null,{"$f":"IF(N7>EingabeAngabe!F46,\"F\",IF(EingabeAngabe!F46=\"\",\"\",EingabeAngabe!F46))","v":2}]
[{"$f":"EingabeAngabe!B12","v":"SE4"},{"$f":"IF(EingabeAngabe!C12=\"\",\"\",EingabeAngabe!C12)","v":""},null,null,null,{"$f":"IF(OR(G8=\"\",G8>EingabeAngabe!F12),\"F\",EingabeAngabe!B12)","v":"F"},null,"Notenschlüssel:"]
[null,{"$f":"IF(EingabeAngabe!C13=\"\",\"\",EingabeAngabe!C13)","v":""},null,null,null,null,null,"Sehr gut",null,null,null,{"$f":"EingabeAngabe!F50","v":"40 - 36"}]
[{"$f":"EingabeAngabe!B14","v":"SE5"},{"$f":"IF(EingabeAngabe!C14=\"\",\"\",EingabeAngabe!C14)","v":""},null,null,null,{"$f":"IF(OR(G10=\"\",G10>EingabeAngabe!F14),\"F\",EingabeAngabe!B14)","v":"F"},null,"Gut",null,null,null,{"$f":"EingabeAngabe!F51","v":"35 - 31"}]
[null,{"$f":"IF(EingabeAngabe!C15=\"\",\"\",EingabeAngabe!C15)","v":""},null,null,null,null,null,"Befriedigend",null,null,null,{"$f":"EingabeAngabe!F52","v":"30 - 26"}]
[{"$f":"EingabeAngabe!B16","v":"SE6"},{"$f":"IF(EingabeAngabe!C16=\"\",\"\",EingabeAngabe!C16)","v":""},null,null,null,{"$f":"IF(OR(G12=\"\",G12>EingabeAngabe!F16),\"F\",EingabeAngabe!B16)","v":"F"},null,"Genügend",null,null,null,{"$f":"EingabeAngabe!F53","v":"25 - 20"}]
[null,{"$f":"IF(EingabeAngabe!C17=\"\",\"\",EingabeAngabe!C17)","v":""},null,null,null,null,null,"Nicht genügend",null,null,null,{"$f":"EingabeAngabe!F54","v":"19 - 00"}]
[{"$f":"EingabeAngabe!B18","v":"SE7"},{"$f":"IF(EingabeAngabe!C18=\"\",\"\",EingabeAngabe!C18)","v":""},null,null,null,{"$f":"IF(OR(G14=\"\",G14>EingabeAngabe!F18),\"F\",EingabeAngabe!B18)","v":"F"},null,{"$f":"CONCATENATE(\"Notendefinition laut LBVO$14:\",\"            \",K31)","v":"Notendefinition laut LBVO$14:            "}]
[null,{"$f":"IF(EingabeAngabe!C19=\"\",\"\",EingabeAngabe!C19)","v":""},null,null,null,null,null,{"$f":"VLOOKUP(K31,SchuelernamenEingabe!D2:'SchuelernamenEingabe'!E40,2,FALSE)","v":{"$error":"#N/A"}}]
[{"$f":"EingabeAngabe!B20","v":"SE8"},{"$f":"IF(EingabeAngabe!C20=\"\",\"\",EingabeAngabe!C20)","v":""},null,null,null,{"$f":"IF(OR(G16=\"\",G16>EingabeAngabe!F20),\"F\",EingabeAngabe!B20)","v":"F"}]
[null,{"$f":"IF(EingabeAngabe!C21=\"\",\"\",EingabeAngabe!C21)","v":""}]
[{"$f":"EingabeAngabe!B23","v":"LE13"},{"$f":"IF(EingabeAngabe!C23=\"\",\"\",EingabeAngabe!C23)","v":""},null,{"$f":"IF(EingabeAngabe!D23=\"\",\"\",EingabeAngabe!D23)","v":""},{"$f":"IF(EingabeAngabe!E23=\"\",\"\",EingabeAngabe!E23)","v":""},{"$f":"IF(OR(G18=\"\",G18>EingabeAngabe!F23),\"F\",EingabeAngabe!B23)","v":"F"}]
[{"$f":"EingabeAngabe!B24","v":"LE14"},{"$f":"IF(EingabeAngabe!C24=\"\",\"\",EingabeAngabe!C24)","v":""},null,{"$f":"IF(EingabeAngabe!D24=\"\",\"\",EingabeAngabe!D24)","v":""},{"$f":"IF(EingabeAngabe!E24=\"\",\"\",EingabeAngabe!E24)","v":""},{"$f":"IF(OR(G19=\"\",G19>EingabeAngabe!F24),\"F\",EingabeAngabe!B24)","v":"F"}]
[{"$f":"EingabeAngabe!B25","v":"LE15"},{"$f":"IF(EingabeAngabe!C25=\"\",\"\",EingabeAngabe!C25)","v":""},null,{"$f":"IF(EingabeAngabe!D25=\"\",\"\",EingabeAngabe!D25)","v":""},{"$f":"IF(EingabeAngabe!E25=\"\",\"\",EingabeAngabe!E25)","v":""},{"$f":"IF(OR(G20=\"\",G20>EingabeAngabe!F25),\"F\",EingabeAngabe!B25)","v":"F"}]
[{"$f":"EingabeAngabe!B26","v":"LE16"},{"$f":"IF(EingabeAngabe!C26=\"\",\"\",EingabeAngabe!C26)","v":""},null,{"$f":"IF(EingabeAngabe!D26=\"\",\"\",EingabeAngabe!D26)","v":""},{"$f":"IF(EingabeAngabe!E26=\"\",\"\",EingabeAngabe!E26)","v":""},{"$f":"IF(OR(G21=\"\",G21>EingabeAngabe!F26),\"F\",EingabeAngabe!B26)","v":"F"}]
[{"$f":"EingabeAngabe!B28","v":"MO19"},{"$f":"IF(EingabeAngabe!C28=\"\",\"\",EingabeAngabe!C28)","v":""},null,{"$f":"IF(EingabeAngabe!D28=\"\",\"\",EingabeAngabe!D28)","v":""},null,{"$f":"IF(OR(G22=\"\",G22>EingabeAngabe!F27),\"F\",EingabeAngabe!B28)","v":"F"}]
[{"$f":"EingabeAngabe!B29","v":"MO20"},{"$f":"IF(EingabeAngabe!C29=\"\",\"\",EingabeAngabe!C29)","v":""},null,{"$f":"IF(EingabeAngabe!D29=\"\",\"\",EingabeAngabe!D29)","v":""},null,{"$f":"IF(OR(G23=\"\",G23>EingabeAngabe!F28),\"F\",EingabeAngabe!B29)","v":"F"},null,{"$f":"IF(EingabeAngabe!F60>\"\",EingabeAngabe!E59,\"\")","v":"Eigener Notenkommentar:"}]
[{"$f":"EingabeAngabe!B30","v":"MO21"},{"$f":"IF(EingabeAngabe!C30=\"\",\"\",EingabeAngabe!C30)","v":""},null,{"$f":"IF(EingabeAngabe!D30=\"\",\"\",EingabeAngabe!D30)","v":""},null,{"$f":"IF(OR(G24=\"\",G24>EingabeAngabe!F29),\"F\",EingabeAngabe!B30)","v":"F"}]
[{"$f":"EingabeAngabe!B31","v":"MO22"},{"$f":"IF(EingabeAngabe!C31=\"\",\"\",EingabeAngabe!C31)","v":""},null,{"$f":"IF(EingabeAngabe!D31=\"\",\"\",EingabeAngabe!D31)","v":""},null,{"$f":"IF(OR(G25=\"\",G25>EingabeAngabe!F30),\"F\",EingabeAngabe!B31)","v":"F"}]
[{"$f":"EingabeAngabe!B33","v":"SY25"},{"$f":"IF(EingabeAngabe!C33=\"\",\"\",EingabeAngabe!C33)","v":""},null,{"$f":"IF(EingabeAngabe!D33=\"\",\"\",EingabeAngabe!D33)","v":""},null,{"$f":"IF(OR(G26=\"\",G26>EingabeAngabe!F31),\"F\",EingabeAngabe!B33)","v":"F"}]
[{"$f":"EingabeAngabe!B34","v":"SY26"},{"$f":"IF(EingabeAngabe!C34=\"\",\"\",EingabeAngabe!C34)","v":""},null,{"$f":"IF(EingabeAngabe!D34=\"\",\"\",EingabeAngabe!D34)","v":""},null,{"$f":"IF(OR(G27=\"\",G27>EingabeAngabe!F32),\"F\",EingabeAngabe!B34)","v":"F"}]
[{"$f":"EingabeAngabe!B35","v":"SY27"},{"$f":"IF(EingabeAngabe!C35=\"\",\"\",EingabeAngabe!C35)","v":""},null,{"$f":"IF(EingabeAngabe!D35=\"\",\"\",EingabeAngabe!D35)","v":""},null,{"$f":"IF(OR(G28=\"\",G28>EingabeAngabe!F33),\"F\",EingabeAngabe!B35)","v":"F"},null,"Summe Übersetzungstext",null,null,null,null,{"$f":"EingabeAngabe!M39","v":""}]
[{"$f":"EingabeAngabe!B36","v":"SY28"},{"$f":"IF(EingabeAngabe!C36=\"\",\"\",EingabeAngabe!C36)","v":""},null,{"$f":"IF(EingabeAngabe!D36=\"\",\"\",EingabeAngabe!D36)","v":""},null,{"$f":"IF(OR(G29=\"\",G29>EingabeAngabe!F34),\"F\",EingabeAngabe!B36)","v":"F"},null,"Summe Arbeitsaufgaben und Interpretation",null,null,null,null,{"$f":"EingabeAngabe!M40","v":""}]
[null,{"$f":"EingabeAngabe!C37","v":"SPRACHLICHE QUALITÄT IN DER ZIELSPRACHE"},null,null,null,{"$f":"IF(OR(G30=1,G30=3,G30=5,G30>5),\"F\",\"4/2/0\")","v":"4/2/0"},null,"Gesamtsumme",null,null,null,null,{"$f":"EingabeAngabe!M2","v":""}]
[null,null,null,null,null,null,null,"NOTE",null,null,{"$f":"IF(EingabeAngabe!M3=1,\"Sehr gut\",IF(EingabeAngabe!M3=2,\"Gut\",IF(EingabeAngabe!M3=3,\"Befriedigend\",IF(EingabeAngabe!M3=4,\"Genügend\",IF(EingabeAngabe!M3=5,\"Nicht genügend\",\"\")))))","v":""}]

{"sheet":"Schueler8Punkte","index":11,"n_rows":31,"n_cols":13,"rows_kept":31,"cut":false,"hidden":false,"merged":[[28,1,28,2],[29,1,29,3],[29,7,29,11],[29,12,29,13],[30,7,30,9],[30,10,30,13],[27,7,27,11],[27,12,27,13],[28,3,28,4],[28,7,28,11],[28,12,28,13],[22,7,22,10],[23,1,23,2],[23,3,23,4],[23,7,26,13],[24,1,24,2],[24,3,24,4],[25,3,25,4],[26,3,26,4],[22,1,22,2],[22,3,22,4],[25,1,25,2],[26,1,26,2],[27,1,27,2],[27,3,27,4],[15,0,16,0],[15,1,15,4],[15,5,16,5],[15,6,16,6],[16,1,16,4],[13,7,13,13],[14,7,21,13],[17,1,17,2],[18,1,18,2],[19,1,19,2],[20,1,20,2],[21,1,21,2],[21,3,21,4],[13,0,14,0],[13,1,13,4],[13,5,14,5],[13,6,14,6],[14,1,14,4],[10,11,10,13],[11,7,11,10],[11,11,11,13],[12,7,12,10],[12,11,12,13],[7,7,7,13],[8,7,8,10],[8,11,8,13],[11,0,12,0],[11,1,11,4],[11,5,12,5],[11,6,12,6],[12,1,12,4],[9,0,10,0],[9,1,9,4],[9,5,10,5],[9,6,10,6],[10,1,10,4],[9,7,9,10],[9,11,9,13],[10,7,10,10],[5,0,6,0],[5,1,5,4],[5,5,6,5],[5,6,6,6],[5,8,5,11],[6,1,6,4],[6,8,6,11],[7,0,8,0],[7,1,7,4],[7,5,8,5],[7,6,8,6],[8,1,8,4],[0,0,0,1],[0,3,0,4],[0,7,0,11],[1,0,2,0],[1,1,1,4],[1,5,2,5],[1,6,2,6],[1,8,1,11],[2,1,2,4],[2,8,2,11],[3,0,4,0],[3,1,3,4],[3,5,4,5],[3,6,4,6],[3,8,3,11],[4,1,4,4],[4,8,4,11]]}
["Übersetzungstext",null,"Schülername",{"$f":"SchuelernamenEingabe!B9","v":0},null,null,null,"Arbeitsaufgaben/ Interpretation"]
[{"$f":"EingabeAngabe!B6","v":"SE1"},{"$f":"IF(EingabeAngabe!C6=\"\",\"\",EingabeAngabe!C6)","v":""},null,null,null,{"$f":"IF(OR(G2=\"\",G2>EingabeAngabe!F6),\"F\",EingabeAngabe!B6)","v":"F"},null,{"$f":"EingabeAngabe!B41","v":"IT1"},{"$f":"IF(EingabeAngabe!C41=\"\",\"\",EingabeAngabe!C41)","v":""},null,null,null,{"$f":"IF(N2>EingabeAngabe!F41,\"F\",IF(EingabeAngabe!F41=\"\",\"\",EingabeAngabe!F41))","v":4}]
[null,{"$f":"IF(EingabeAngabe!C7=\"\",\"\",EingabeAngabe!C7)","v":""},null,null,null,null,null,{"$f":"EingabeAngabe!B42","v":"IT2"},{"$f":"IF(EingabeAngabe!C42=\"\",\"\",EingabeAngabe!C42)","v":""},null,null,null,{"$f":"IF(N3>EingabeAngabe!F42,\"F\",IF(EingabeAngabe!F42=\"\",\"\",EingabeAngabe!F42))","v":4}]
[{"$f":"EingabeAngabe!B8","v":"SE2"},{"$f":"IF(EingabeAngabe!C8=\"\",\"\",EingabeAngabe!C8)","v":""},null,null,null,{"$f":"IF(OR(G4=\"\",G4>EingabeAngabe!F8),\"F\",EingabeAngabe!B8)","v":"F"},null,{"$f":"EingabeAngabe!B43","v":"IT3"},{"$f":"IF(EingabeAngabe!C43=\"\",\"\",EingabeAngabe!C43)","v":""},null,null,null,{"$f":"IF(N4>EingabeAngabe!F43,\"F\",IF(EingabeAngabe!F43=\"\",\"\",EingabeAngabe!F43))","v":2}]
[null,{"$f":"IF(EingabeAngabe!C9=\"\",\"\",EingabeAngabe!C9)","v":""},null,null,null,null,null,{"$f":"EingabeAngabe!B44","v":"IT4"},{"$f":"IF(EingabeAngabe!C44=\"\",\"\",EingabeAngabe!C44)","v":""},null,null,null,{"$f":"IF(N5>EingabeAngabe!F44,\"F\",IF(EingabeAngabe!F44=\"\",\"\",EingabeAngabe!F44))","v":2}]
[{"$f":"EingabeAngabe!B10","v":"SE3"},{"$f":"IF(EingabeAngabe!C10=\"\",\"\",EingabeAngabe!C10)","v":""},null,null,null,{"$f":"IF(OR(G6=\"\",G6>EingabeAngabe!F10),\"F\",EingabeAngabe!B10)","v":"F"},null,{"$f":"EingabeAngabe!B45","v":"IT5"},{"$f":"IF(EingabeAngabe!C45=\"\",\"\",EingabeAngabe!C45)","v":""},null,null,null,{"$f":"IF(N6>EingabeAngabe!F45,\"F\",IF(EingabeAngabe!F45=\"\",\"\",EingabeAngabe!F45))","v":2}]
[null,{"$f":"IF(EingabeAngabe!C11=\"\",\"\",EingabeAngabe!C11)","v":""},null,null,null,null,null,{"$f":"EingabeAngabe!B46","v":"IT6"},{"$f":"IF(EingabeAngabe!C46=\"\",\"\",EingabeAngabe!C46)","v":""},null,null,null,{"$f":"IF(N7>EingabeAngabe!F46,\"F\",IF(EingabeAngabe!F46=\"\",\"\",EingabeAngabe!F46))","v":2}]
[{"$f":"EingabeAngabe!B12","v":"SE4"},{"$f":"IF(EingabeAngabe!C12=\"\",\"\",EingabeAngabe!C12)","v":""},null,null,null,{"$f":"IF(OR(G8=\"\",G8>EingabeAngabe!F12),\"F\",EingabeAngabe!B12)","v":"F"},null,"Notenschlüssel:"]
[null,{"$f":"IF(EingabeAngabe!C13=\"\",\"\",EingabeAngabe!C13)","v":""},null,null,null,null,null,"Sehr gut",null,null,null,{"$f":"EingabeAngabe!F50","v":"40 - 36"}]
[{"$f":"EingabeAngabe!B14","v":"SE5"},{"$f":"IF(EingabeAngabe!C14=\"\",\"\",EingabeAngabe!C14)","v":""},null,null,null,{"$f":"IF(OR(G10=\"\",G10>EingabeAngabe!F14),\"F\",EingabeAngabe!B14)","v":"F"},null,"Gut",null,null,null,{"$f":"EingabeAngabe!F51","v":"35 - 31"}]
[null,{"$f":"IF(EingabeAngabe!C15=\"\",\"\",EingabeAngabe!C15)","v":""},null,null,null,null,null,"Befriedigend",null,null,null,{"$f":"EingabeAngabe!F52","v":"30 - 26"}]
[{"$f":"EingabeAngabe!B16","v":"SE6"},{"$f":"IF(EingabeAngabe!C16=\"\",\"\",EingabeAngabe!C16)","v":""},null,null,null,{"$f":"IF(OR(G12=\"\",G12>EingabeAngabe!F16),\"F\",EingabeAngabe!B16)","v":"F"},null,"Genügend",null,null,null,{"$f":"EingabeAngabe!F53","v":"25 - 20"}]
[null,{"$f":"IF(EingabeAngabe!C17=\"\",\"\",EingabeAngabe!C17)","v":""},null,null,null,null,null,"Nicht genügend",null,null,null,{"$f":"EingabeAngabe!F54","v":"19 - 00"}]
[{"$f":"EingabeAngabe!B18","v":"SE7"},{"$f":"IF(EingabeAngabe!C18=\"\",\"\",EingabeAngabe!C18)","v":""},null,null,null,{"$f":"IF(OR(G14=\"\",G14>EingabeAngabe!F18),\"F\",EingabeAngabe!B18)","v":"F"},null,{"$f":"CONCATENATE(\"Notendefinition laut LBVO$14:\",\"            \",K31)","v":"Notendefinition laut LBVO$14:            "}]
[null,{"$f":"IF(EingabeAngabe!C19=\"\",\"\",EingabeAngabe!C19)","v":""},null,null,null,null,null,{"$f":"VLOOKUP(K31,SchuelernamenEingabe!D2:'SchuelernamenEingabe'!E40,2,FALSE)","v":{"$error":"#N/A"}}]
[{"$f":"EingabeAngabe!B20","v":"SE8"},{"$f":"IF(EingabeAngabe!C20=\"\",\"\",EingabeAngabe!C20)","v":""},null,null,null,{"$f":"IF(OR(G16=\"\",G16>EingabeAngabe!F20),\"F\",EingabeAngabe!B20)","v":"F"}]
[null,{"$f":"IF(EingabeAngabe!C21=\"\",\"\",EingabeAngabe!C21)","v":""}]
[{"$f":"EingabeAngabe!B23","v":"LE13"},{"$f":"IF(EingabeAngabe!C23=\"\",\"\",EingabeAngabe!C23)","v":""},null,{"$f":"IF(EingabeAngabe!D23=\"\",\"\",EingabeAngabe!D23)","v":""},{"$f":"IF(EingabeAngabe!E23=\"\",\"\",EingabeAngabe!E23)","v":""},{"$f":"IF(OR(G18=\"\",G18>EingabeAngabe!F23),\"F\",EingabeAngabe!B23)","v":"F"}]
[{"$f":"EingabeAngabe!B24","v":"LE14"},{"$f":"IF(EingabeAngabe!C24=\"\",\"\",EingabeAngabe!C24)","v":""},null,{"$f":"IF(EingabeAngabe!D24=\"\",\"\",EingabeAngabe!D24)","v":""},{"$f":"IF(EingabeAngabe!E24=\"\",\"\",EingabeAngabe!E24)","v":""},{"$f":"IF(OR(G19=\"\",G19>EingabeAngabe!F24),\"F\",EingabeAngabe!B24)","v":"F"}]
[{"$f":"EingabeAngabe!B25","v":"LE15"},{"$f":"IF(EingabeAngabe!C25=\"\",\"\",EingabeAngabe!C25)","v":""},null,{"$f":"IF(EingabeAngabe!D25=\"\",\"\",EingabeAngabe!D25)","v":""},{"$f":"IF(EingabeAngabe!E25=\"\",\"\",EingabeAngabe!E25)","v":""},{"$f":"IF(OR(G20=\"\",G20>EingabeAngabe!F25),\"F\",EingabeAngabe!B25)","v":"F"}]
[{"$f":"EingabeAngabe!B26","v":"LE16"},{"$f":"IF(EingabeAngabe!C26=\"\",\"\",EingabeAngabe!C26)","v":""},null,{"$f":"IF(EingabeAngabe!D26=\"\",\"\",EingabeAngabe!D26)","v":""},{"$f":"IF(EingabeAngabe!E26=\"\",\"\",EingabeAngabe!E26)","v":""},{"$f":"IF(OR(G21=\"\",G21>EingabeAngabe!F26),\"F\",EingabeAngabe!B26)","v":"F"}]
[{"$f":"EingabeAngabe!B28","v":"MO19"},{"$f":"IF(EingabeAngabe!C28=\"\",\"\",EingabeAngabe!C28)","v":""},null,{"$f":"IF(EingabeAngabe!D28=\"\",\"\",EingabeAngabe!D28)","v":""},null,{"$f":"IF(OR(G22=\"\",G22>EingabeAngabe!F27),\"F\",EingabeAngabe!B28)","v":"F"}]
[{"$f":"EingabeAngabe!B29","v":"MO20"},{"$f":"IF(EingabeAngabe!C29=\"\",\"\",EingabeAngabe!C29)","v":""},null,{"$f":"IF(EingabeAngabe!D29=\"\",\"\",EingabeAngabe!D29)","v":""},null,{"$f":"IF(OR(G23=\"\",G23>EingabeAngabe!F28),\"F\",EingabeAngabe!B29)","v":"F"},null,{"$f":"IF(EingabeAngabe!F60>\"\",EingabeAngabe!E59,\"\")","v":"Eigener Notenkommentar:"}]
[{"$f":"EingabeAngabe!B30","v":"MO21"},{"$f":"IF(EingabeAngabe!C30=\"\",\"\",EingabeAngabe!C30)","v":""},null,{"$f":"IF(EingabeAngabe!D30=\"\",\"\",EingabeAngabe!D30)","v":""},null,{"$f":"IF(OR(G24=\"\",G24>EingabeAngabe!F29),\"F\",EingabeAngabe!B30)","v":"F"}]
[{"$f":"EingabeAngabe!B31","v":"MO22"},{"$f":"IF(EingabeAngabe!C31=\"\",\"\",EingabeAngabe!C31)","v":""},null,{"$f":"IF(EingabeAngabe!D31=\"\",\"\",EingabeAngabe!D31)","v":""},null,{"$f":"IF(OR(G25=\"\",G25>EingabeAngabe!F30),\"F\",EingabeAngabe!B31)","v":"F"}]
[{"$f":"EingabeAngabe!B33","v":"SY25"},{"$f":"IF(EingabeAngabe!C33=\"\",\"\",EingabeAngabe!C33)","v":""},null,{"$f":"IF(EingabeAngabe!D33=\"\",\"\",EingabeAngabe!D33)","v":""},null,{"$f":"IF(OR(G26=\"\",G26>EingabeAngabe!F31),\"F\",EingabeAngabe!B33)","v":"F"}]
[{"$f":"EingabeAngabe!B34","v":"SY26"},{"$f":"IF(EingabeAngabe!C34=\"\",\"\",EingabeAngabe!C34)","v":""},null,{"$f":"IF(EingabeAngabe!D34=\"\",\"\",EingabeAngabe!D34)","v":""},null,{"$f":"IF(OR(G27=\"\",G27>EingabeAngabe!F32),\"F\",EingabeAngabe!B34)","v":"F"}]
[{"$f":"EingabeAngabe!B35","v":"SY27"},{"$f":"IF(EingabeAngabe!C35=\"\",\"\",EingabeAngabe!C35)","v":""},null,{"$f":"IF(EingabeAngabe!D35=\"\",\"\",EingabeAngabe!D35)","v":""},null,{"$f":"IF(OR(G28=\"\",G28>EingabeAngabe!F33),\"F\",EingabeAngabe!B35)","v":"F"},null,"Summe Übersetzungstext",null,null,null,null,{"$f":"EingabeAngabe!N39","v":""}]
[{"$f":"EingabeAngabe!B36","v":"SY28"},{"$f":"IF(EingabeAngabe!C36=\"\",\"\",EingabeAngabe!C36)","v":""},null,{"$f":"IF(EingabeAngabe!D36=\"\",\"\",EingabeAngabe!D36)","v":""},null,{"$f":"IF(OR(G29=\"\",G29>EingabeAngabe!F34),\"F\",EingabeAngabe!B36)","v":"F"},null,"Summe Arbeitsaufgaben und Interpretation",null,null,null,null,{"$f":"EingabeAngabe!N40","v":""}]
[null,{"$f":"EingabeAngabe!C37","v":"SPRACHLICHE QUALITÄT IN DER ZIELSPRACHE"},null,null,null,{"$f":"IF(OR(G30=1,G30=3,G30=5,G30>5),\"F\",\"4/2/0\")","v":"4/2/0"},null,"Gesamtsumme",null,null,null,null,{"$f":"EingabeAngabe!N2","v":""}]
[null,null,null,null,null,null,null,"NOTE",null,null,{"$f":"IF(EingabeAngabe!N3=1,\"Sehr gut\",IF(EingabeAngabe!N3=2,\"Gut\",IF(EingabeAngabe!N3=3,\"Befriedigend\",IF(EingabeAngabe!N3=4,\"Genügend\",IF(EingabeAngabe!N3=5,\"Nicht genügend\",\"\")))))","v":""}]

{"sheet":"Schueler9Punkte","index":12,"n_rows":31,"n_cols":13,"rows_kept":31,"cut":false,"hidden":false,"merged":[[28,1,28,2],[29,1,29,3],[29,7,29,11],[29,12,29,13],[30,7,30,9],[30,10,30,13],[27,7,27,11],[27,12,27,13],[28,3,28,4],[28,7,28,11],[28,12,28,13],[22,7,22,10],[23,1,23,2],[23,3,23,4],[23,7,26,13],[24,1,24,2],[24,3,24,4],[25,3,25,4],[26,3,26,4],[22,1,22,2],[22,3,22,4],[25,1,25,2],[26,1,26,2],[27,1,27,2],[27,3,27,4],[15,0,16,0],[15,1,15,4],[15,5,16,5],[15,6,16,6],[16,1,16,4],[13,7,13,13],[14,7,21,13],[17,1,17,2],[18,1,18,2],[19,1,19,2],[20,1,20,2],[21,1,21,2],[21,3,21,4],[13,0,14,0],[13,1,13,4],[13,5,14,5],[13,6,14,6],[14,1,14,4],[10,11,10,13],[11,7,11,10],[11,11,11,13],[12,7,12,10],[12,11,12,13],[7,7,7,13],[8,7,8,10],[8,11,8,13],[11,0,12,0],[11,1,11,4],[11,5,12,5],[11,6,12,6],[12,1,12,4],[9,0,10,0],[9,1,9,4],[9,5,10,5],[9,6,10,6],[10,1,10,4],[9,7,9,10],[9,11,9,13],[10,7,10,10],[5,0,6,0],[5,1,5,4],[5,5,6,5],[5,6,6,6],[5,8,5,11],[6,1,6,4],[6,8,6,11],[7,0,8,0],[7,1,7,4],[7,5,8,5],[7,6,8,6],[8,1,8,4],[0,0,0,1],[0,3,0,4],[0,7,0,11],[1,0,2,0],[1,1,1,4],[1,5,2,5],[1,6,2,6],[1,8,1,11],[2,1,2,4],[2,8,2,11],[3,0,4,0],[3,1,3,4],[3,5,4,5],[3,6,4,6],[3,8,3,11],[4,1,4,4],[4,8,4,11]]}
["Übersetzungstext",null,"Schülername",{"$f":"SchuelernamenEingabe!B10","v":0},null,null,null,"Arbeitsaufgaben/ Interpretation"]
[{"$f":"EingabeAngabe!B6","v":"SE1"},{"$f":"IF(EingabeAngabe!C6=\"\",\"\",EingabeAngabe!C6)","v":""},null,null,null,{"$f":"IF(OR(G2=\"\",G2>EingabeAngabe!F6),\"F\",EingabeAngabe!B6)","v":"F"},null,{"$f":"EingabeAngabe!B41","v":"IT1"},{"$f":"IF(EingabeAngabe!C41=\"\",\"\",EingabeAngabe!C41)","v":""},null,null,null,{"$f":"IF(N2>EingabeAngabe!F41,\"F\",IF(EingabeAngabe!F41=\"\",\"\",EingabeAngabe!F41))","v":4}]
[null,{"$f":"IF(EingabeAngabe!C7=\"\",\"\",EingabeAngabe!C7)","v":""},null,null,null,null,null,{"$f":"EingabeAngabe!B42","v":"IT2"},{"$f":"IF(EingabeAngabe!C42=\"\",\"\",EingabeAngabe!C42)","v":""},null,null,null,{"$f":"IF(N3>EingabeAngabe!F42,\"F\",IF(EingabeAngabe!F42=\"\",\"\",EingabeAngabe!F42))","v":4}]
[{"$f":"EingabeAngabe!B8","v":"SE2"},{"$f":"IF(EingabeAngabe!C8=\"\",\"\",EingabeAngabe!C8)","v":""},null,null,null,{"$f":"IF(OR(G4=\"\",G4>EingabeAngabe!F8),\"F\",EingabeAngabe!B8)","v":"F"},null,{"$f":"EingabeAngabe!B43","v":"IT3"},{"$f":"IF(EingabeAngabe!C43=\"\",\"\",EingabeAngabe!C43)","v":""},null,null,null,{"$f":"IF(N4>EingabeAngabe!F43,\"F\",IF(EingabeAngabe!F43=\"\",\"\",EingabeAngabe!F43))","v":2}]
[null,{"$f":"IF(EingabeAngabe!C9=\"\",\"\",EingabeAngabe!C9)","v":""},null,null,null,null,null,{"$f":"EingabeAngabe!B44","v":"IT4"},{"$f":"IF(EingabeAngabe!C44=\"\",\"\",EingabeAngabe!C44)","v":""},null,null,null,{"$f":"IF(N5>EingabeAngabe!F44,\"F\",IF(EingabeAngabe!F44=\"\",\"\",EingabeAngabe!F44))","v":2}]
[{"$f":"EingabeAngabe!B10","v":"SE3"},{"$f":"IF(EingabeAngabe!C10=\"\",\"\",EingabeAngabe!C10)","v":""},null,null,null,{"$f":"IF(OR(G6=\"\",G6>EingabeAngabe!F10),\"F\",EingabeAngabe!B10)","v":"F"},null,{"$f":"EingabeAngabe!B45","v":"IT5"},{"$f":"IF(EingabeAngabe!C45=\"\",\"\",EingabeAngabe!C45)","v":""},null,null,null,{"$f":"IF(N6>EingabeAngabe!F45,\"F\",IF(EingabeAngabe!F45=\"\",\"\",EingabeAngabe!F45))","v":2}]
[null,{"$f":"IF(EingabeAngabe!C11=\"\",\"\",EingabeAngabe!C11)","v":""},null,null,null,null,null,{"$f":"EingabeAngabe!B46","v":"IT6"},{"$f":"IF(EingabeAngabe!C46=\"\",\"\",EingabeAngabe!C46)","v":""},null,null,null,{"$f":"IF(N7>EingabeAngabe!F46,\"F\",IF(EingabeAngabe!F46=\"\",\"\",EingabeAngabe!F46))","v":2}]
[{"$f":"EingabeAngabe!B12","v":"SE4"},{"$f":"IF(EingabeAngabe!C12=\"\",\"\",EingabeAngabe!C12)","v":""},null,null,null,{"$f":"IF(OR(G8=\"\",G8>EingabeAngabe!F12),\"F\",EingabeAngabe!B12)","v":"F"},null,"Notenschlüssel:"]
[null,{"$f":"IF(EingabeAngabe!C13=\"\",\"\",EingabeAngabe!C13)","v":""},null,null,null,null,null,"Sehr gut",null,null,null,{"$f":"EingabeAngabe!F50","v":"40 - 36"}]
[{"$f":"EingabeAngabe!B14","v":"SE5"},{"$f":"IF(EingabeAngabe!C14=\"\",\"\",EingabeAngabe!C14)","v":""},null,null,null,{"$f":"IF(OR(G10=\"\",G10>EingabeAngabe!F14),\"F\",EingabeAngabe!B14)","v":"F"},null,"Gut",null,null,null,{"$f":"EingabeAngabe!F51","v":"35 - 31"}]
[null,{"$f":"IF(EingabeAngabe!C15=\"\",\"\",EingabeAngabe!C15)","v":""},null,null,null,null,null,"Befriedigend",null,null,null,{"$f":"EingabeAngabe!F52","v":"30 - 26"}]
[{"$f":"EingabeAngabe!B16","v":"SE6"},{"$f":"IF(EingabeAngabe!C16=\"\",\"\",EingabeAngabe!C16)","v":""},null,null,null,{"$f":"IF(OR(G12=\"\",G12>EingabeAngabe!F16),\"F\",EingabeAngabe!B16)","v":"F"},null,"Genügend",null,null,null,{"$f":"EingabeAngabe!F53","v":"25 - 20"}]
[null,{"$f":"IF(EingabeAngabe!C17=\"\",\"\",EingabeAngabe!C17)","v":""},null,null,null,null,null,"Nicht genügend",null,null,null,{"$f":"EingabeAngabe!F54","v":"19 - 00"}]
[{"$f":"EingabeAngabe!B18","v":"SE7"},{"$f":"IF(EingabeAngabe!C18=\"\",\"\",EingabeAngabe!C18)","v":""},null,null,null,{"$f":"IF(OR(G14=\"\",G14>EingabeAngabe!F18),\"F\",EingabeAngabe!B18)","v":"F"},null,{"$f":"CONCATENATE(\"Notendefinition laut LBVO$14:\",\"            \",K31)","v":"Notendefinition laut LBVO$14:            "}]
[null,{"$f":"IF(EingabeAngabe!C19=\"\",\"\",EingabeAngabe!C19)","v":""},null,null,null,null,null,{"$f":"VLOOKUP(K31,SchuelernamenEingabe!D2:'SchuelernamenEingabe'!E40,2,FALSE)","v":{"$error":"#N/A"}}]
[{"$f":"EingabeAngabe!B20","v":"SE8"},{"$f":"IF(EingabeAngabe!C20=\"\",\"\",EingabeAngabe!C20)","v":""},null,null,null,{"$f":"IF(OR(G16=\"\",G16>EingabeAngabe!F20),\"F\",EingabeAngabe!B20)","v":"F"}]
[null,{"$f":"IF(EingabeAngabe!C21=\"\",\"\",EingabeAngabe!C21)","v":""}]
[{"$f":"EingabeAngabe!B23","v":"LE13"},{"$f":"IF(EingabeAngabe!C23=\"\",\"\",EingabeAngabe!C23)","v":""},null,{"$f":"IF(EingabeAngabe!D23=\"\",\"\",EingabeAngabe!D23)","v":""},{"$f":"IF(EingabeAngabe!E23=\"\",\"\",EingabeAngabe!E23)","v":""},{"$f":"IF(OR(G18=\"\",G18>EingabeAngabe!F23),\"F\",EingabeAngabe!B23)","v":"F"}]
[{"$f":"EingabeAngabe!B24","v":"LE14"},{"$f":"IF(EingabeAngabe!C24=\"\",\"\",EingabeAngabe!C24)","v":""},null,{"$f":"IF(EingabeAngabe!D24=\"\",\"\",EingabeAngabe!D24)","v":""},{"$f":"IF(EingabeAngabe!E24=\"\",\"\",EingabeAngabe!E24)","v":""},{"$f":"IF(OR(G19=\"\",G19>EingabeAngabe!F24),\"F\",EingabeAngabe!B24)","v":"F"}]
[{"$f":"EingabeAngabe!B25","v":"LE15"},{"$f":"IF(EingabeAngabe!C25=\"\",\"\",EingabeAngabe!C25)","v":""},null,{"$f":"IF(EingabeAngabe!D25=\"\",\"\",EingabeAngabe!D25)","v":""},{"$f":"IF(EingabeAngabe!E25=\"\",\"\",EingabeAngabe!E25)","v":""},{"$f":"IF(OR(G20=\"\",G20>EingabeAngabe!F25),\"F\",EingabeAngabe!B25)","v":"F"}]
[{"$f":"EingabeAngabe!B26","v":"LE16"},{"$f":"IF(EingabeAngabe!C26=\"\",\"\",EingabeAngabe!C26)","v":""},null,{"$f":"IF(EingabeAngabe!D26=\"\",\"\",EingabeAngabe!D26)","v":""},{"$f":"IF(EingabeAngabe!E26=\"\",\"\",EingabeAngabe!E26)","v":""},{"$f":"IF(OR(G21=\"\",G21>EingabeAngabe!F26),\"F\",EingabeAngabe!B26)","v":"F"}]
[{"$f":"EingabeAngabe!B28","v":"MO19"},{"$f":"IF(EingabeAngabe!C28=\"\",\"\",EingabeAngabe!C28)","v":""},null,{"$f":"IF(EingabeAngabe!D28=\"\",\"\",EingabeAngabe!D28)","v":""},null,{"$f":"IF(OR(G22=\"\",G22>EingabeAngabe!F27),\"F\",EingabeAngabe!B28)","v":"F"}]
[{"$f":"EingabeAngabe!B29","v":"MO20"},{"$f":"IF(EingabeAngabe!C29=\"\",\"\",EingabeAngabe!C29)","v":""},null,{"$f":"IF(EingabeAngabe!D29=\"\",\"\",EingabeAngabe!D29)","v":""},null,{"$f":"IF(OR(G23=\"\",G23>EingabeAngabe!F28),\"F\",EingabeAngabe!B29)","v":"F"},null,{"$f":"IF(EingabeAngabe!F60>\"\",EingabeAngabe!E59,\"\")","v":"Eigener Notenkommentar:"}]
[{"$f":"EingabeAngabe!B30","v":"MO21"},{"$f":"IF(EingabeAngabe!C30=\"\",\"\",EingabeAngabe!C30)","v":""},null,{"$f":"IF(EingabeAngabe!D30=\"\",\"\",EingabeAngabe!D30)","v":""},null,{"$f":"IF(OR(G24=\"\",G24>EingabeAngabe!F29),\"F\",EingabeAngabe!B30)","v":"F"}]
[{"$f":"EingabeAngabe!B31","v":"MO22"},{"$f":"IF(EingabeAngabe!C31=\"\",\"\",EingabeAngabe!C31)","v":""},null,{"$f":"IF(EingabeAngabe!D31=\"\",\"\",EingabeAngabe!D31)","v":""},null,{"$f":"IF(OR(G25=\"\",G25>EingabeAngabe!F30),\"F\",EingabeAngabe!B31)","v":"F"}]
[{"$f":"EingabeAngabe!B33","v":"SY25"},{"$f":"IF(EingabeAngabe!C33=\"\",\"\",EingabeAngabe!C33)","v":""},null,{"$f":"IF(EingabeAngabe!D33=\"\",\"\",EingabeAngabe!D33)","v":""},null,{"$f":"IF(OR(G26=\"\",G26>EingabeAngabe!F31),\"F\",EingabeAngabe!B33)","v":"F"}]
[{"$f":"EingabeAngabe!B34","v":"SY26"},{"$f":"IF(EingabeAngabe!C34=\"\",\"\",EingabeAngabe!C34)","v":""},null,{"$f":"IF(EingabeAngabe!D34=\"\",\"\",EingabeAngabe!D34)","v":""},null,{"$f":"IF(OR(G27=\"\",G27>EingabeAngabe!F32),\"F\",EingabeAngabe!B34)","v":"F"}]
[{"$f":"EingabeAngabe!B35","v":"SY27"},{"$f":"IF(EingabeAngabe!C35=\"\",\"\",EingabeAngabe!C35)","v":""},null,{"$f":"IF(EingabeAngabe!D35=\"\",\"\",EingabeAngabe!D35)","v":""},null,{"$f":"IF(OR(G28=\"\",G28>EingabeAngabe!F33),\"F\",EingabeAngabe!B35)","v":"F"},null,"Summe Übersetzungstext",null,null,null,null,{"$f":"EingabeAngabe!O39","v":""}]
[{"$f":"EingabeAngabe!B36","v":"SY28"},{"$f":"IF(EingabeAngabe!C36=\"\",\"\",EingabeAngabe!C36)","v":""},null,{"$f":"IF(EingabeAngabe!D36=\"\",\"\",EingabeAngabe!D36)","v":""},null,{"$f":"IF(OR(G29=\"\",G29>EingabeAngabe!F34),\"F\",EingabeAngabe!B36)","v":"F"},null,"Summe Arbeitsaufgaben und Interpretation",null,null,null,null,{"$f":"EingabeAngabe!O40","v":""}]
[null,{"$f":"EingabeAngabe!C37","v":"SPRACHLICHE QUALITÄT IN DER ZIELSPRACHE"},null,null,null,{"$f":"IF(OR(G30=1,G30=3,G30=5,G30>5),\"F\",\"4/2/0\")","v":"4/2/0"},null,"Gesamtsumme",null,null,null,null,{"$f":"EingabeAngabe!O2","v":""}]
[null,null,null,null,null,null,null,"NOTE",null,null,{"$f":"IF(EingabeAngabe!O3=1,\"Sehr gut\",IF(EingabeAngabe!O3=2,\"Gut\",IF(EingabeAngabe!O3=3,\"Befriedigend\",IF(EingabeAngabe!O3=4,\"Genügend\",IF(EingabeAngabe!O3=5,\"Nicht genügend\",\"\")))))","v":""}]

{"sheet":"Schueler10Punkte","index":13,"n_rows":31,"n_cols":13,"rows_kept":31,"cut":false,"hidden":false,"merged":[[28,1,28,2],[29,1,29,3],[29,7,29,11],[29,12,29,13],[30,7,30,9],[30,10,30,13],[27,7,27,11],[27,12,27,13],[28,3,28,4],[28,7,28,11],[28,12,28,13],[22,7,22,10],[23,1,23,2],[23,3,23,4],[23,7,26,13],[24,1,24,2],[24,3,24,4],[25,3,25,4],[26,3,26,4],[22,1,22,2],[22,3,22,4],[25,1,25,2],[26,1,26,2],[27,1,27,2],[27,3,27,4],[15,0,16,0],[15,1,15,4],[15,5,16,5],[15,6,16,6],[16,1,16,4],[13,7,13,13],[14,7,21,13],[17,1,17,2],[18,1,18,2],[19,1,19,2],[20,1,20,2],[21,1,21,2],[21,3,21,4],[13,0,14,0],[13,1,13,4],[13,5,14,5],[13,6,14,6],[14,1,14,4],[10,11,10,13],[11,7,11,10],[11,11,11,13],[12,7,12,10],[12,11,12,13],[7,7,7,13],[8,7,8,10],[8,11,8,13],[11,0,12,0],[11,1,11,4],[11,5,12,5],[11,6,12,6],[12,1,12,4],[9,0,10,0],[9,1,9,4],[9,5,10,5],[9,6,10,6],[10,1,10,4],[9,7,9,10],[9,11,9,13],[10,7,10,10],[5,0,6,0],[5,1,5,4],[5,5,6,5],[5,6,6,6],[5,8,5,11],[6,1,6,4],[6,8,6,11],[7,0,8,0],[7,1,7,4],[7,5,8,5],[7,6,8,6],[8,1,8,4],[0,0,0,1],[0,3,0,4],[0,7,0,11],[1,0,2,0],[1,1,1,4],[1,5,2,5],[1,6,2,6],[1,8,1,11],[2,1,2,4],[2,8,2,11],[3,0,4,0],[3,1,3,4],[3,5,4,5],[3,6,4,6],[3,8,3,11],[4,1,4,4],[4,8,4,11]]}
["Übersetzungstext",null,"Schülername",{"$f":"SchuelernamenEingabe!B11","v":0},null,null,null,"Arbeitsaufgaben/ Interpretation"]
[{"$f":"EingabeAngabe!B6","v":"SE1"},{"$f":"IF(EingabeAngabe!C6=\"\",\"\",EingabeAngabe!C6)","v":""},null,null,null,{"$f":"IF(OR(G2=\"\",G2>EingabeAngabe!F6),\"F\",EingabeAngabe!B6)","v":"F"},null,{"$f":"EingabeAngabe!B41","v":"IT1"},{"$f":"IF(EingabeAngabe!C41=\"\",\"\",EingabeAngabe!C41)","v":""},null,null,null,{"$f":"IF(N2>EingabeAngabe!F41,\"F\",IF(EingabeAngabe!F41=\"\",\"\",EingabeAngabe!F41))","v":4}]
[null,{"$f":"IF(EingabeAngabe!C7=\"\",\"\",EingabeAngabe!C7)","v":""},null,null,null,null,null,{"$f":"EingabeAngabe!B42","v":"IT2"},{"$f":"IF(EingabeAngabe!C42=\"\",\"\",EingabeAngabe!C42)","v":""},null,null,null,{"$f":"IF(N3>EingabeAngabe!F42,\"F\",IF(EingabeAngabe!F42=\"\",\"\",EingabeAngabe!F42))","v":4}]
[{"$f":"EingabeAngabe!B8","v":"SE2"},{"$f":"IF(EingabeAngabe!C8=\"\",\"\",EingabeAngabe!C8)","v":""},null,null,null,{"$f":"IF(OR(G4=\"\",G4>EingabeAngabe!F8),\"F\",EingabeAngabe!B8)","v":"F"},null,{"$f":"EingabeAngabe!B43","v":"IT3"},{"$f":"IF(EingabeAngabe!C43=\"\",\"\",EingabeAngabe!C43)","v":""},null,null,null,{"$f":"IF(N4>EingabeAngabe!F43,\"F\",IF(EingabeAngabe!F43=\"\",\"\",EingabeAngabe!F43))","v":2}]
[null,{"$f":"IF(EingabeAngabe!C9=\"\",\"\",EingabeAngabe!C9)","v":""},null,null,null,null,null,{"$f":"EingabeAngabe!B44","v":"IT4"},{"$f":"IF(EingabeAngabe!C44=\"\",\"\",EingabeAngabe!C44)","v":""},null,null,null,{"$f":"IF(N5>EingabeAngabe!F44,\"F\",IF(EingabeAngabe!F44=\"\",\"\",EingabeAngabe!F44))","v":2}]
[{"$f":"EingabeAngabe!B10","v":"SE3"},{"$f":"IF(EingabeAngabe!C10=\"\",\"\",EingabeAngabe!C10)","v":""},null,null,null,{"$f":"IF(OR(G6=\"\",G6>EingabeAngabe!F10),\"F\",EingabeAngabe!B10)","v":"F"},null,{"$f":"EingabeAngabe!B45","v":"IT5"},{"$f":"IF(EingabeAngabe!C45=\"\",\"\",EingabeAngabe!C45)","v":""},null,null,null,{"$f":"IF(N6>EingabeAngabe!F45,\"F\",IF(EingabeAngabe!F45=\"\",\"\",EingabeAngabe!F45))","v":2}]
[null,{"$f":"IF(EingabeAngabe!C11=\"\",\"\",EingabeAngabe!C11)","v":""},null,null,null,null,null,{"$f":"EingabeAngabe!B46","v":"IT6"},{"$f":"IF(EingabeAngabe!C46=\"\",\"\",EingabeAngabe!C46)","v":""},null,null,null,{"$f":"IF(N7>EingabeAngabe!F46,\"F\",IF(EingabeAngabe!F46=\"\",\"\",EingabeAngabe!F46))","v":2}]
[{"$f":"EingabeAngabe!B12","v":"SE4"},{"$f":"IF(EingabeAngabe!C12=\"\",\"\",EingabeAngabe!C12)","v":""},null,null,null,{"$f":"IF(OR(G8=\"\",G8>EingabeAngabe!F12),\"F\",EingabeAngabe!B12)","v":"F"},null,"Notenschlüssel:"]
[null,{"$f":"IF(EingabeAngabe!C13=\"\",\"\",EingabeAngabe!C13)","v":""},null,null,null,null,null,"Sehr gut",null,null,null,{"$f":"EingabeAngabe!F50","v":"40 - 36"}]
[{"$f":"EingabeAngabe!B14","v":"SE5"},{"$f":"IF(EingabeAngabe!C14=\"\",\"\",EingabeAngabe!C14)","v":""},null,null,null,{"$f":"IF(OR(G10=\"\",G10>EingabeAngabe!F14),\"F\",EingabeAngabe!B14)","v":"F"},null,"Gut",null,null,null,{"$f":"EingabeAngabe!F51","v":"35 - 31"}]
[null,{"$f":"IF(EingabeAngabe!C15=\"\",\"\",EingabeAngabe!C15)","v":""},null,null,null,null,null,"Befriedigend",null,null,null,{"$f":"EingabeAngabe!F52","v":"30 - 26"}]
[{"$f":"EingabeAngabe!B16","v":"SE6"},{"$f":"IF(EingabeAngabe!C16=\"\",\"\",EingabeAngabe!C16)","v":""},null,null,null,{"$f":"IF(OR(G12=\"\",G12>EingabeAngabe!F16),\"F\",EingabeAngabe!B16)","v":"F"},null,"Genügend",null,null,null,{"$f":"EingabeAngabe!F53","v":"25 - 20"}]
[null,{"$f":"IF(EingabeAngabe!C17=\"\",\"\",EingabeAngabe!C17)","v":""},null,null,null,null,null,"Nicht genügend",null,null,null,{"$f":"EingabeAngabe!F54","v":"19 - 00"}]
[{"$f":"EingabeAngabe!B18","v":"SE7"},{"$f":"IF(EingabeAngabe!C18=\"\",\"\",EingabeAngabe!C18)","v":""},null,null,null,{"$f":"IF(OR(G14=\"\",G14>EingabeAngabe!F18),\"F\",EingabeAngabe!B18)","v":"F"},null,{"$f":"CONCATENATE(\"Notendefinition laut LBVO$14:\",\"            \",K31)","v":"Notendefinition laut LBVO$14:            "}]
[null,{"$f":"IF(EingabeAngabe!C19=\"\",\"\",EingabeAngabe!C19)","v":""},null,null,null,null,null,{"$f":"VLOOKUP(K31,SchuelernamenEingabe!D2:'SchuelernamenEingabe'!E40,2,FALSE)","v":{"$error":"#N/A"}}]
[{"$f":"EingabeAngabe!B20","v":"SE8"},{"$f":"IF(EingabeAngabe!C20=\"\",\"\",EingabeAngabe!C20)","v":""},null,null,null,{"$f":"IF(OR(G16=\"\",G16>EingabeAngabe!F20),\"F\",EingabeAngabe!B20)","v":"F"}]
[null,{"$f":"IF(EingabeAngabe!C21=\"\",\"\",EingabeAngabe!C21)","v":""}]
[{"$f":"EingabeAngabe!B23","v":"LE13"},{"$f":"IF(EingabeAngabe!C23=\"\",\"\",EingabeAngabe!C23)","v":""},null,{"$f":"IF(EingabeAngabe!D23=\"\",\"\",EingabeAngabe!D23)","v":""},{"$f":"IF(EingabeAngabe!E23=\"\",\"\",EingabeAngabe!E23)","v":""},{"$f":"IF(OR(G18=\"\",G18>EingabeAngabe!F23),\"F\",EingabeAngabe!B23)","v":"F"}]
[{"$f":"EingabeAngabe!B24","v":"LE14"},{"$f":"IF(EingabeAngabe!C24=\"\",\"\",EingabeAngabe!C24)","v":""},null,{"$f":"IF(EingabeAngabe!D24=\"\",\"\",EingabeAngabe!D24)","v":""},{"$f":"IF(EingabeAngabe!E24=\"\",\"\",EingabeAngabe!E24)","v":""},{"$f":"IF(OR(G19=\"\",G19>EingabeAngabe!F24),\"F\",EingabeAngabe!B24)","v":"F"}]
[{"$f":"EingabeAngabe!B25","v":"LE15"},{"$f":"IF(EingabeAngabe!C25=\"\",\"\",EingabeAngabe!C25)","v":""},null,{"$f":"IF(EingabeAngabe!D25=\"\",\"\",EingabeAngabe!D25)","v":""},{"$f":"IF(EingabeAngabe!E25=\"\",\"\",EingabeAngabe!E25)","v":""},{"$f":"IF(OR(G20=\"\",G20>EingabeAngabe!F25),\"F\",EingabeAngabe!B25)","v":"F"}]
[{"$f":"EingabeAngabe!B26","v":"LE16"},{"$f":"IF(EingabeAngabe!C26=\"\",\"\",EingabeAngabe!C26)","v":""},null,{"$f":"IF(EingabeAngabe!D26=\"\",\"\",EingabeAngabe!D26)","v":""},{"$f":"IF(EingabeAngabe!E26=\"\",\"\",EingabeAngabe!E26)","v":""},{"$f":"IF(OR(G21=\"\",G21>EingabeAngabe!F26),\"F\",EingabeAngabe!B26)","v":"F"}]
[{"$f":"EingabeAngabe!B28","v":"MO19"},{"$f":"IF(EingabeAngabe!C28=\"\",\"\",EingabeAngabe!C28)","v":""},null,{"$f":"IF(EingabeAngabe!D28=\"\",\"\",EingabeAngabe!D28)","v":""},null,{"$f":"IF(OR(G22=\"\",G22>EingabeAngabe!F27),\"F\",EingabeAngabe!B28)","v":"F"}]
[{"$f":"EingabeAngabe!B29","v":"MO20"},{"$f":"IF(EingabeAngabe!C29=\"\",\"\",EingabeAngabe!C29)","v":""},null,{"$f":"IF(EingabeAngabe!D29=\"\",\"\",EingabeAngabe!D29)","v":""},null,{"$f":"IF(OR(G23=\"\",G23>EingabeAngabe!F28),\"F\",EingabeAngabe!B29)","v":"F"},null,{"$f":"IF(EingabeAngabe!F60>\"\",EingabeAngabe!E59,\"\")","v":"Eigener Notenkommentar:"}]
[{"$f":"EingabeAngabe!B30","v":"MO21"},{"$f":"IF(EingabeAngabe!C30=\"\",\"\",EingabeAngabe!C30)","v":""},null,{"$f":"IF(EingabeAngabe!D30=\"\",\"\",EingabeAngabe!D30)","v":""},null,{"$f":"IF(OR(G24=\"\",G24>EingabeAngabe!F29),\"F\",EingabeAngabe!B30)","v":"F"}]
[{"$f":"EingabeAngabe!B31","v":"MO22"},{"$f":"IF(EingabeAngabe!C31=\"\",\"\",EingabeAngabe!C31)","v":""},null,{"$f":"IF(EingabeAngabe!D31=\"\",\"\",EingabeAngabe!D31)","v":""},null,{"$f":"IF(OR(G25=\"\",G25>EingabeAngabe!F30),\"F\",EingabeAngabe!B31)","v":"F"}]
[{"$f":"EingabeAngabe!B33","v":"SY25"},{"$f":"IF(EingabeAngabe!C33=\"\",\"\",EingabeAngabe!C33)","v":""},null,{"$f":"IF(EingabeAngabe!D33=\"\",\"\",EingabeAngabe!D33)","v":""},null,{"$f":"IF(OR(G26=\"\",G26>EingabeAngabe!F31),\"F\",EingabeAngabe!B33)","v":"F"}]
[{"$f":"EingabeAngabe!B34","v":"SY26"},{"$f":"IF(EingabeAngabe!C34=\"\",\"\",EingabeAngabe!C34)","v":""},null,{"$f":"IF(EingabeAngabe!D34=\"\",\"\",EingabeAngabe!D34)","v":""},null,{"$f":"IF(OR(G27=\"\",G27>EingabeAngabe!F32),\"F\",EingabeAngabe!B34)","v":"F"}]
[{"$f":"EingabeAngabe!B35","v":"SY27"},{"$f":"IF(EingabeAngabe!C35=\"\",\"\",EingabeAngabe!C35)","v":""},null,{"$f":"IF(EingabeAngabe!D35=\"\",\"\",EingabeAngabe!D35)","v":""},null,{"$f":"IF(OR(G28=\"\",G28>EingabeAngabe!F33),\"F\",EingabeAngabe!B35)","v":"F"},null,"Summe Übersetzungstext",null,null,null,null,{"$f":"EingabeAngabe!P39","v":""}]
[{"$f":"EingabeAngabe!B36","v":"SY28"},{"$f":"IF(EingabeAngabe!C36=\"\",\"\",EingabeAngabe!C36)","v":""},null,{"$f":"IF(EingabeAngabe!D36=\"\",\"\",EingabeAngabe!D36)","v":""},null,{"$f":"IF(OR(G29=\"\",G29>EingabeAngabe!F34),\"F\",EingabeAngabe!B36)","v":"F"},null,"Summe Arbeitsaufgaben und Interpretation",null,null,null,null,{"$f":"EingabeAngabe!P40","v":""}]
[null,{"$f":"EingabeAngabe!C37","v":"SPRACHLICHE QUALITÄT IN DER ZIELSPRACHE"},null,null,null,{"$f":"IF(OR(G30=1,G30=3,G30=5,G30>5),\"F\",\"4/2/0\")","v":"4/2/0"},null,"Gesamtsumme",null,null,null,null,{"$f":"EingabeAngabe!P2","v":""}]
[null,null,null,null,null,null,null,"NOTE",null,null,{"$f":"IF(EingabeAngabe!P3=1,\"Sehr gut\",IF(EingabeAngabe!P3=2,\"Gut\",IF(EingabeAngabe!P3=3,\"Befriedigend\",IF(EingabeAngabe!P3=4,\"Genügend\",IF(EingabeAngabe!P3=5,\"Nicht genügend\",\"\")))))","v":""}]

{"sheet":"Schueler11Punkte","index":14,"n_rows":31,"n_cols":13,"rows_kept":31,"cut":false,"hidden":false,"merged":[[28,1,28,2],[29,1,29,3],[29,7,29,11],[29,12,29,13],[30,7,30,9],[30,10,30,13],[27,7,27,11],[27,12,27,13],[28,3,28,4],[28,7,28,11],[28,12,28,13],[22,7,22,10],[23,1,23,2],[23,3,23,4],[23,7,26,13],[24,1,24,2],[24,3,24,4],[25,3,25,4],[26,3,26,4],[22,1,22,2],[22,3,22,4],[25,1,25,2],[26,1,26,2],[27,1,27,2],[27,3,27,4],[15,0,16,0],[15,1,15,4],[15,5,16,5],[15,6,16,6],[16,1,16,4],[13,7,13,13],[14,7,21,13],[17,1,17,2],[18,1,18,2],[19,1,19,2],[20,1,20,2],[21,1,21,2],[21,3,21,4],[13,0,14,0],[13,1,13,4],[13,5,14,5],[13,6,14,6],[14,1,14,4],[10,11,10,13],[11,7,11,10],[11,11,11,13],[12,7,12,10],[12,11,12,13],[7,7,7,13],[8,7,8,10],[8,11,8,13],[11,0,12,0],[11,1,11,4],[11,5,12,5],[11,6,12,6],[12,1,12,4],[9,0,10,0],[9,1,9,4],[9,5,10,5],[9,6,10,6],[10,1,10,4],[9,7,9,10],[9,11,9,13],[10,7,10,10],[5,0,6,0],[5,1,5,4],[5,5,6,5],[5,6,6,6],[5,8,5,11],[6,1,6,4],[6,8,6,11],[7,0,8,0],[7,1,7,4],[7,5,8,5],[7,6,8,6],[8,1,8,4],[0,0,0,1],[0,3,0,4],[0,7,0,11],[1,0,2,0],[1,1,1,4],[1,5,2,5],[1,6,2,6],[1,8,1,11],[2,1,2,4],[2,8,2,11],[3,0,4,0],[3,1,3,4],[3,5,4,5],[3,6,4,6],[3,8,3,11],[4,1,4,4],[4,8,4,11]]}
["Übersetzungstext",null,"Schülername",{"$f":"SchuelernamenEingabe!B12","v":0},null,null,null,"Arbeitsaufgaben/ Interpretation"]
[{"$f":"EingabeAngabe!B6","v":"SE1"},{"$f":"IF(EingabeAngabe!C6=\"\",\"\",EingabeAngabe!C6)","v":""},null,null,null,{"$f":"IF(OR(G2=\"\",G2>EingabeAngabe!F6),\"F\",EingabeAngabe!B6)","v":"F"},null,{"$f":"EingabeAngabe!B41","v":"IT1"},{"$f":"IF(EingabeAngabe!C41=\"\",\"\",EingabeAngabe!C41)","v":""},null,null,null,{"$f":"IF(N2>EingabeAngabe!F41,\"F\",IF(EingabeAngabe!F41=\"\",\"\",EingabeAngabe!F41))","v":4}]
[null,{"$f":"IF(EingabeAngabe!C7=\"\",\"\",EingabeAngabe!C7)","v":""},null,null,null,null,null,{"$f":"EingabeAngabe!B42","v":"IT2"},{"$f":"IF(EingabeAngabe!C42=\"\",\"\",EingabeAngabe!C42)","v":""},null,null,null,{"$f":"IF(N3>EingabeAngabe!F42,\"F\",IF(EingabeAngabe!F42=\"\",\"\",EingabeAngabe!F42))","v":4}]
[{"$f":"EingabeAngabe!B8","v":"SE2"},{"$f":"IF(EingabeAngabe!C8=\"\",\"\",EingabeAngabe!C8)","v":""},null,null,null,{"$f":"IF(OR(G4=\"\",G4>EingabeAngabe!F8),\"F\",EingabeAngabe!B8)","v":"F"},null,{"$f":"EingabeAngabe!B43","v":"IT3"},{"$f":"IF(EingabeAngabe!C43=\"\",\"\",EingabeAngabe!C43)","v":""},null,null,null,{"$f":"IF(N4>EingabeAngabe!F43,\"F\",IF(EingabeAngabe!F43=\"\",\"\",EingabeAngabe!F43))","v":2}]
[null,{"$f":"IF(EingabeAngabe!C9=\"\",\"\",EingabeAngabe!C9)","v":""},null,null,null,null,null,{"$f":"EingabeAngabe!B44","v":"IT4"},{"$f":"IF(EingabeAngabe!C44=\"\",\"\",EingabeAngabe!C44)","v":""},null,null,null,{"$f":"IF(N5>EingabeAngabe!F44,\"F\",IF(EingabeAngabe!F44=\"\",\"\",EingabeAngabe!F44))","v":2}]
[{"$f":"EingabeAngabe!B10","v":"SE3"},{"$f":"IF(EingabeAngabe!C10=\"\",\"\",EingabeAngabe!C10)","v":""},null,null,null,{"$f":"IF(OR(G6=\"\",G6>EingabeAngabe!F10),\"F\",EingabeAngabe!B10)","v":"F"},null,{"$f":"EingabeAngabe!B45","v":"IT5"},{"$f":"IF(EingabeAngabe!C45=\"\",\"\",EingabeAngabe!C45)","v":""},null,null,null,{"$f":"IF(N6>EingabeAngabe!F45,\"F\",IF(EingabeAngabe!F45=\"\",\"\",EingabeAngabe!F45))","v":2}]
[null,{"$f":"IF(EingabeAngabe!C11=\"\",\"\",EingabeAngabe!C11)","v":""},null,null,null,null,null,{"$f":"EingabeAngabe!B46","v":"IT6"},{"$f":"IF(EingabeAngabe!C46=\"\",\"\",EingabeAngabe!C46)","v":""},null,null,null,{"$f":"IF(N7>EingabeAngabe!F46,\"F\",IF(EingabeAngabe!F46=\"\",\"\",EingabeAngabe!F46))","v":2}]
[{"$f":"EingabeAngabe!B12","v":"SE4"},{"$f":"IF(EingabeAngabe!C12=\"\",\"\",EingabeAngabe!C12)","v":""},null,null,null,{"$f":"IF(OR(G8=\"\",G8>EingabeAngabe!F12),\"F\",EingabeAngabe!B12)","v":"F"},null,"Notenschlüssel:"]
[null,{"$f":"IF(EingabeAngabe!C13=\"\",\"\",EingabeAngabe!C13)","v":""},null,null,null,null,null,"Sehr gut",null,null,null,{"$f":"EingabeAngabe!F50","v":"40 - 36"}]
[{"$f":"EingabeAngabe!B14","v":"SE5"},{"$f":"IF(EingabeAngabe!C14=\"\",\"\",EingabeAngabe!C14)","v":""},null,null,null,{"$f":"IF(OR(G10=\"\",G10>EingabeAngabe!F14),\"F\",EingabeAngabe!B14)","v":"F"},null,"Gut",null,null,null,{"$f":"EingabeAngabe!F51","v":"35 - 31"}]
[null,{"$f":"IF(EingabeAngabe!C15=\"\",\"\",EingabeAngabe!C15)","v":""},null,null,null,null,null,"Befriedigend",null,null,null,{"$f":"EingabeAngabe!F52","v":"30 - 26"}]
[{"$f":"EingabeAngabe!B16","v":"SE6"},{"$f":"IF(EingabeAngabe!C16=\"\",\"\",EingabeAngabe!C16)","v":""},null,null,null,{"$f":"IF(OR(G12=\"\",G12>EingabeAngabe!F16),\"F\",EingabeAngabe!B16)","v":"F"},null,"Genügend",null,null,null,{"$f":"EingabeAngabe!F53","v":"25 - 20"}]
[null,{"$f":"IF(EingabeAngabe!C17=\"\",\"\",EingabeAngabe!C17)","v":""},null,null,null,null,null,"Nicht genügend",null,null,null,{"$f":"EingabeAngabe!F54","v":"19 - 00"}]
[{"$f":"EingabeAngabe!B18","v":"SE7"},{"$f":"IF(EingabeAngabe!C18=\"\",\"\",EingabeAngabe!C18)","v":""},null,null,null,{"$f":"IF(OR(G14=\"\",G14>EingabeAngabe!F18),\"F\",EingabeAngabe!B18)","v":"F"},null,{"$f":"CONCATENATE(\"Notendefinition laut LBVO$14:\",\"            \",K31)","v":"Notendefinition laut LBVO$14:            "}]
[null,{"$f":"IF(EingabeAngabe!C19=\"\",\"\",EingabeAngabe!C19)","v":""},null,null,null,null,null,{"$f":"VLOOKUP(K31,SchuelernamenEingabe!D2:'SchuelernamenEingabe'!E40,2,FALSE)","v":{"$error":"#N/A"}}]
[{"$f":"EingabeAngabe!B20","v":"SE8"},{"$f":"IF(EingabeAngabe!C20=\"\",\"\",EingabeAngabe!C20)","v":""},null,null,null,{"$f":"IF(OR(G16=\"\",G16>EingabeAngabe!F20),\"F\",EingabeAngabe!B20)","v":"F"}]
[null,{"$f":"IF(EingabeAngabe!C21=\"\",\"\",EingabeAngabe!C21)","v":""}]
[{"$f":"EingabeAngabe!B23","v":"LE13"},{"$f":"IF(EingabeAngabe!C23=\"\",\"\",EingabeAngabe!C23)","v":""},null,{"$f":"IF(EingabeAngabe!D23=\"\",\"\",EingabeAngabe!D23)","v":""},{"$f":"IF(EingabeAngabe!E23=\"\",\"\",EingabeAngabe!E23)","v":""},{"$f":"IF(OR(G18=\"\",G18>EingabeAngabe!F23),\"F\",EingabeAngabe!B23)","v":"F"}]
[{"$f":"EingabeAngabe!B24","v":"LE14"},{"$f":"IF(EingabeAngabe!C24=\"\",\"\",EingabeAngabe!C24)","v":""},null,{"$f":"IF(EingabeAngabe!D24=\"\",\"\",EingabeAngabe!D24)","v":""},{"$f":"IF(EingabeAngabe!E24=\"\",\"\",EingabeAngabe!E24)","v":""},{"$f":"IF(OR(G19=\"\",G19>EingabeAngabe!F24),\"F\",EingabeAngabe!B24)","v":"F"}]
[{"$f":"EingabeAngabe!B25","v":"LE15"},{"$f":"IF(EingabeAngabe!C25=\"\",\"\",EingabeAngabe!C25)","v":""},null,{"$f":"IF(EingabeAngabe!D25=\"\",\"\",EingabeAngabe!D25)","v":""},{"$f":"IF(EingabeAngabe!E25=\"\",\"\",EingabeAngabe!E25)","v":""},{"$f":"IF(OR(G20=\"\",G20>EingabeAngabe!F25),\"F\",EingabeAngabe!B25)","v":"F"}]
[{"$f":"EingabeAngabe!B26","v":"LE16"},{"$f":"IF(EingabeAngabe!C26=\"\",\"\",EingabeAngabe!C26)","v":""},null,{"$f":"IF(EingabeAngabe!D26=\"\",\"\",EingabeAngabe!D26)","v":""},{"$f":"IF(EingabeAngabe!E26=\"\",\"\",EingabeAngabe!E26)","v":""},{"$f":"IF(OR(G21=\"\",G21>EingabeAngabe!F26),\"F\",EingabeAngabe!B26)","v":"F"}]
[{"$f":"EingabeAngabe!B28","v":"MO19"},{"$f":"IF(EingabeAngabe!C28=\"\",\"\",EingabeAngabe!C28)","v":""},null,{"$f":"IF(EingabeAngabe!D28=\"\",\"\",EingabeAngabe!D28)","v":""},null,{"$f":"IF(OR(G22=\"\",G22>EingabeAngabe!F27),\"F\",EingabeAngabe!B28)","v":"F"}]
[{"$f":"EingabeAngabe!B29","v":"MO20"},{"$f":"IF(EingabeAngabe!C29=\"\",\"\",EingabeAngabe!C29)","v":""},null,{"$f":"IF(EingabeAngabe!D29=\"\",\"\",EingabeAngabe!D29)","v":""},null,{"$f":"IF(OR(G23=\"\",G23>EingabeAngabe!F28),\"F\",EingabeAngabe!B29)","v":"F"},null,{"$f":"IF(EingabeAngabe!F60>\"\",EingabeAngabe!E59,\"\")","v":"Eigener Notenkommentar:"}]
[{"$f":"EingabeAngabe!B30","v":"MO21"},{"$f":"IF(EingabeAngabe!C30=\"\",\"\",EingabeAngabe!C30)","v":""},null,{"$f":"IF(EingabeAngabe!D30=\"\",\"\",EingabeAngabe!D30)","v":""},null,{"$f":"IF(OR(G24=\"\",G24>EingabeAngabe!F29),\"F\",EingabeAngabe!B30)","v":"F"}]
[{"$f":"EingabeAngabe!B31","v":"MO22"},{"$f":"IF(EingabeAngabe!C31=\"\",\"\",EingabeAngabe!C31)","v":""},null,{"$f":"IF(EingabeAngabe!D31=\"\",\"\",EingabeAngabe!D31)","v":""},null,{"$f":"IF(OR(G25=\"\",G25>EingabeAngabe!F30),\"F\",EingabeAngabe!B31)","v":"F"}]
[{"$f":"EingabeAngabe!B33","v":"SY25"},{"$f":"IF(EingabeAngabe!C33=\"\",\"\",EingabeAngabe!C33)","v":""},null,{"$f":"IF(EingabeAngabe!D33=\"\",\"\",EingabeAngabe!D33)","v":""},null,{"$f":"IF(OR(G26=\"\",G26>EingabeAngabe!F31),\"F\",EingabeAngabe!B33)","v":"F"}]
[{"$f":"EingabeAngabe!B34","v":"SY26"},{"$f":"IF(EingabeAngabe!C34=\"\",\"\",EingabeAngabe!C34)","v":""},null,{"$f":"IF(EingabeAngabe!D34=\"\",\"\",EingabeAngabe!D34)","v":""},null,{"$f":"IF(OR(G27=\"\",G27>EingabeAngabe!F32),\"F\",EingabeAngabe!B34)","v":"F"}]
[{"$f":"EingabeAngabe!B35","v":"SY27"},{"$f":"IF(EingabeAngabe!C35=\"\",\"\",EingabeAngabe!C35)","v":""},null,{"$f":"IF(EingabeAngabe!D35=\"\",\"\",EingabeAngabe!D35)","v":""},null,{"$f":"IF(OR(G28=\"\",G28>EingabeAngabe!F33),\"F\",EingabeAngabe!B35)","v":"F"},null,"Summe Übersetzungstext",null,null,null,null,{"$f":"EingabeAngabe!Q39","v":""}]
[{"$f":"EingabeAngabe!B36","v":"SY28"},{"$f":"IF(EingabeAngabe!C36=\"\",\"\",EingabeAngabe!C36)","v":""},null,{"$f":"IF(EingabeAngabe!D36=\"\",\"\",EingabeAngabe!D36)","v":""},null,{"$f":"IF(OR(G29=\"\",G29>EingabeAngabe!F34),\"F\",EingabeAngabe!B36)","v":"F"},null,"Summe Arbeitsaufgaben und Interpretation",null,null,null,null,{"$f":"EingabeAngabe!Q40","v":""}]
[null,{"$f":"EingabeAngabe!C37","v":"SPRACHLICHE QUALITÄT IN DER ZIELSPRACHE"},null,null,null,{"$f":"IF(OR(G30=1,G30=3,G30=5,G30>5),\"F\",\"4/2/0\")","v":"4/2/0"},null,"Gesamtsumme",null,null,null,null,{"$f":"EingabeAngabe!Q2","v":""}]
[null,null,null,null,null,null,null,"NOTE",null,null,{"$f":"IF(EingabeAngabe!Q3=1,\"Sehr gut\",IF(EingabeAngabe!Q3=2,\"Gut\",IF(EingabeAngabe!Q3=3,\"Befriedigend\",IF(EingabeAngabe!Q3=4,\"Genügend\",IF(EingabeAngabe!Q3=5,\"Nicht genügend\",\"\")))))","v":""}]

{"sheet":"Schueler12Punkte","index":15,"n_rows":31,"n_cols":13,"rows_kept":31,"cut":false,"hidden":false,"merged":[[28,1,28,2],[29,1,29,3],[29,7,29,11],[29,12,29,13],[30,7,30,9],[30,10,30,13],[27,7,27,11],[27,12,27,13],[28,3,28,4],[28,7,28,11],[28,12,28,13],[22,7,22,10],[23,1,23,2],[23,3,23,4],[23,7,26,13],[24,1,24,2],[24,3,24,4],[25,3,25,4],[26,3,26,4],[22,1,22,2],[22,3,22,4],[25,1,25,2],[26,1,26,2],[27,1,27,2],[27,3,27,4],[15,0,16,0],[15,1,15,4],[15,5,16,5],[15,6,16,6],[16,1,16,4],[13,7,13,13],[14,7,21,13],[17,1,17,2],[18,1,18,2],[19,1,19,2],[20,1,20,2],[21,1,21,2],[21,3,21,4],[13,0,14,0],[13,1,13,4],[13,5,14,5],[13,6,14,6],[14,1,14,4],[10,11,10,13],[11,7,11,10],[11,11,11,13],[12,7,12,10],[12,11,12,13],[7,7,7,13],[8,7,8,10],[8,11,8,13],[11,0,12,0],[11,1,11,4],[11,5,12,5],[11,6,12,6],[12,1,12,4],[9,0,10,0],[9,1,9,4],[9,5,10,5],[9,6,10,6],[10,1,10,4],[9,7,9,10],[9,11,9,13],[10,7,10,10],[5,0,6,0],[5,1,5,4],[5,5,6,5],[5,6,6,6],[5,8,5,11],[6,1,6,4],[6,8,6,11],[7,0,8,0],[7,1,7,4],[7,5,8,5],[7,6,8,6],[8,1,8,4],[0,0,0,1],[0,3,0,4],[0,7,0,11],[1,0,2,0],[1,1,1,4],[1,5,2,5],[1,6,2,6],[1,8,1,11],[2,1,2,4],[2,8,2,11],[3,0,4,0],[3,1,3,4],[3,5,4,5],[3,6,4,6],[3,8,3,11],[4,1,4,4],[4,8,4,11]]}
["Übersetzungstext",null,"Schülername",{"$f":"SchuelernamenEingabe!B13","v":0},null,null,null,"Arbeitsaufgaben/ Interpretation"]
[{"$f":"EingabeAngabe!B6","v":"SE1"},{"$f":"IF(EingabeAngabe!C6=\"\",\"\",EingabeAngabe!C6)","v":""},null,null,null,{"$f":"IF(OR(G2=\"\",G2>EingabeAngabe!F6),\"F\",EingabeAngabe!B6)","v":"F"},null,{"$f":"EingabeAngabe!B41","v":"IT1"},{"$f":"IF(EingabeAngabe!C41=\"\",\"\",EingabeAngabe!C41)","v":""},null,null,null,{"$f":"IF(N2>EingabeAngabe!F41,\"F\",IF(EingabeAngabe!F41=\"\",\"\",EingabeAngabe!F41))","v":4}]
[null,{"$f":"IF(EingabeAngabe!C7=\"\",\"\",EingabeAngabe!C7)","v":""},null,null,null,null,null,{"$f":"EingabeAngabe!B42","v":"IT2"},{"$f":"IF(EingabeAngabe!C42=\"\",\"\",EingabeAngabe!C42)","v":""},null,null,null,{"$f":"IF(N3>EingabeAngabe!F42,\"F\",IF(EingabeAngabe!F42=\"\",\"\",EingabeAngabe!F42))","v":4}]
[{"$f":"EingabeAngabe!B8","v":"SE2"},{"$f":"IF(EingabeAngabe!C8=\"\",\"\",EingabeAngabe!C8)","v":""},null,null,null,{"$f":"IF(OR(G4=\"\",G4>EingabeAngabe!F8),\"F\",EingabeAngabe!B8)","v":"F"},null,{"$f":"EingabeAngabe!B43","v":"IT3"},{"$f":"IF(EingabeAngabe!C43=\"\",\"\",EingabeAngabe!C43)","v":""},null,null,null,{"$f":"IF(N4>EingabeAngabe!F43,\"F\",IF(EingabeAngabe!F43=\"\",\"\",EingabeAngabe!F43))","v":2}]
[null,{"$f":"IF(EingabeAngabe!C9=\"\",\"\",EingabeAngabe!C9)","v":""},null,null,null,null,null,{"$f":"EingabeAngabe!B44","v":"IT4"},{"$f":"IF(EingabeAngabe!C44=\"\",\"\",EingabeAngabe!C44)","v":""},null,null,null,{"$f":"IF(N5>EingabeAngabe!F44,\"F\",IF(EingabeAngabe!F44=\"\",\"\",EingabeAngabe!F44))","v":2}]
[{"$f":"EingabeAngabe!B10","v":"SE3"},{"$f":"IF(EingabeAngabe!C10=\"\",\"\",EingabeAngabe!C10)","v":""},null,null,null,{"$f":"IF(OR(G6=\"\",G6>EingabeAngabe!F10),\"F\",EingabeAngabe!B10)","v":"F"},null,{"$f":"EingabeAngabe!B45","v":"IT5"},{"$f":"IF(EingabeAngabe!C45=\"\",\"\",EingabeAngabe!C45)","v":""},null,null,null,{"$f":"IF(N6>EingabeAngabe!F45,\"F\",IF(EingabeAngabe!F45=\"\",\"\",EingabeAngabe!F45))","v":2}]
[null,{"$f":"IF(EingabeAngabe!C11=\"\",\"\",EingabeAngabe!C11)","v":""},null,null,null,null,null,{"$f":"EingabeAngabe!B46","v":"IT6"},{"$f":"IF(EingabeAngabe!C46=\"\",\"\",EingabeAngabe!C46)","v":""},null,null,null,{"$f":"IF(N7>EingabeAngabe!F46,\"F\",IF(EingabeAngabe!F46=\"\",\"\",EingabeAngabe!F46))","v":2}]
[{"$f":"EingabeAngabe!B12","v":"SE4"},{"$f":"IF(EingabeAngabe!C12=\"\",\"\",EingabeAngabe!C12)","v":""},null,null,null,{"$f":"IF(OR(G8=\"\",G8>EingabeAngabe!F12),\"F\",EingabeAngabe!B12)","v":"F"},null,"Notenschlüssel:"]
[null,{"$f":"IF(EingabeAngabe!C13=\"\",\"\",EingabeAngabe!C13)","v":""},null,null,null,null,null,"Sehr gut",null,null,null,{"$f":"EingabeAngabe!F50","v":"40 - 36"}]
[{"$f":"EingabeAngabe!B14","v":"SE5"},{"$f":"IF(EingabeAngabe!C14=\"\",\"\",EingabeAngabe!C14)","v":""},null,null,null,{"$f":"IF(OR(G10=\"\",G10>EingabeAngabe!F14),\"F\",EingabeAngabe!B14)","v":"F"},null,"Gut",null,null,null,{"$f":"EingabeAngabe!F51","v":"35 - 31"}]
[null,{"$f":"IF(EingabeAngabe!C15=\"\",\"\",EingabeAngabe!C15)","v":""},null,null,null,null,null,"Befriedigend",null,null,null,{"$f":"EingabeAngabe!F52","v":"30 - 26"}]
[{"$f":"EingabeAngabe!B16","v":"SE6"},{"$f":"IF(EingabeAngabe!C16=\"\",\"\",EingabeAngabe!C16)","v":""},null,null,null,{"$f":"IF(OR(G12=\"\",G12>EingabeAngabe!F16),\"F\",EingabeAngabe!B16)","v":"F"},null,"Genügend",null,null,null,{"$f":"EingabeAngabe!F53","v":"25 - 20"}]
[null,{"$f":"IF(EingabeAngabe!C17=\"\",\"\",EingabeAngabe!C17)","v":""},null,null,null,null,null,"Nicht genügend",null,null,null,{"$f":"EingabeAngabe!F54","v":"19 - 00"}]
[{"$f":"EingabeAngabe!B18","v":"SE7"},{"$f":"IF(EingabeAngabe!C18=\"\",\"\",EingabeAngabe!C18)","v":""},null,null,null,{"$f":"IF(OR(G14=\"\",G14>EingabeAngabe!F18),\"F\",EingabeAngabe!B18)","v":"F"},null,{"$f":"CONCATENATE(\"Notendefinition laut LBVO$14:\",\"            \",K31)","v":"Notendefinition laut LBVO$14:            "}]
[null,{"$f":"IF(EingabeAngabe!C19=\"\",\"\",EingabeAngabe!C19)","v":""},null,null,null,null,null,{"$f":"VLOOKUP(K31,SchuelernamenEingabe!D2:'SchuelernamenEingabe'!E40,2,FALSE)","v":{"$error":"#N/A"}}]
[{"$f":"EingabeAngabe!B20","v":"SE8"},{"$f":"IF(EingabeAngabe!C20=\"\",\"\",EingabeAngabe!C20)","v":""},null,null,null,{"$f":"IF(OR(G16=\"\",G16>EingabeAngabe!F20),\"F\",EingabeAngabe!B20)","v":"F"}]
[null,{"$f":"IF(EingabeAngabe!C21=\"\",\"\",EingabeAngabe!C21)","v":""}]
[{"$f":"EingabeAngabe!B23","v":"LE13"},{"$f":"IF(EingabeAngabe!C23=\"\",\"\",EingabeAngabe!C23)","v":""},null,{"$f":"IF(EingabeAngabe!D23=\"\",\"\",EingabeAngabe!D23)","v":""},{"$f":"IF(EingabeAngabe!E23=\"\",\"\",EingabeAngabe!E23)","v":""},{"$f":"IF(OR(G18=\"\",G18>EingabeAngabe!F23),\"F\",EingabeAngabe!B23)","v":"F"}]
[{"$f":"EingabeAngabe!B24","v":"LE14"},{"$f":"IF(EingabeAngabe!C24=\"\",\"\",EingabeAngabe!C24)","v":""},null,{"$f":"IF(EingabeAngabe!D24=\"\",\"\",EingabeAngabe!D24)","v":""},{"$f":"IF(EingabeAngabe!E24=\"\",\"\",EingabeAngabe!E24)","v":""},{"$f":"IF(OR(G19=\"\",G19>EingabeAngabe!F24),\"F\",EingabeAngabe!B24)","v":"F"}]
[{"$f":"EingabeAngabe!B25","v":"LE15"},{"$f":"IF(EingabeAngabe!C25=\"\",\"\",EingabeAngabe!C25)","v":""},null,{"$f":"IF(EingabeAngabe!D25=\"\",\"\",EingabeAngabe!D25)","v":""},{"$f":"IF(EingabeAngabe!E25=\"\",\"\",EingabeAngabe!E25)","v":""},{"$f":"IF(OR(G20=\"\",G20>EingabeAngabe!F25),\"F\",EingabeAngabe!B25)","v":"F"}]
[{"$f":"EingabeAngabe!B26","v":"LE16"},{"$f":"IF(EingabeAngabe!C26=\"\",\"\",EingabeAngabe!C26)","v":""},null,{"$f":"IF(EingabeAngabe!D26=\"\",\"\",EingabeAngabe!D26)","v":""},{"$f":"IF(EingabeAngabe!E26=\"\",\"\",EingabeAngabe!E26)","v":""},{"$f":"IF(OR(G21=\"\",G21>EingabeAngabe!F26),\"F\",EingabeAngabe!B26)","v":"F"}]
[{"$f":"EingabeAngabe!B28","v":"MO19"},{"$f":"IF(EingabeAngabe!C28=\"\",\"\",EingabeAngabe!C28)","v":""},null,{"$f":"IF(EingabeAngabe!D28=\"\",\"\",EingabeAngabe!D28)","v":""},null,{"$f":"IF(OR(G22=\"\",G22>EingabeAngabe!F27),\"F\",EingabeAngabe!B28)","v":"F"}]
[{"$f":"EingabeAngabe!B29","v":"MO20"},{"$f":"IF(EingabeAngabe!C29=\"\",\"\",EingabeAngabe!C29)","v":""},null,{"$f":"IF(EingabeAngabe!D29=\"\",\"\",EingabeAngabe!D29)","v":""},null,{"$f":"IF(OR(G23=\"\",G23>EingabeAngabe!F28),\"F\",EingabeAngabe!B29)","v":"F"},null,{"$f":"IF(EingabeAngabe!F60>\"\",EingabeAngabe!E59,\"\")","v":"Eigener Notenkommentar:"}]
[{"$f":"EingabeAngabe!B30","v":"MO21"},{"$f":"IF(EingabeAngabe!C30=\"\",\"\",EingabeAngabe!C30)","v":""},null,{"$f":"IF(EingabeAngabe!D30=\"\",\"\",EingabeAngabe!D30)","v":""},null,{"$f":"IF(OR(G24=\"\",G24>EingabeAngabe!F29),\"F\",EingabeAngabe!B30)","v":"F"}]
[{"$f":"EingabeAngabe!B31","v":"MO22"},{"$f":"IF(EingabeAngabe!C31=\"\",\"\",EingabeAngabe!C31)","v":""},null,{"$f":"IF(EingabeAngabe!D31=\"\",\"\",EingabeAngabe!D31)","v":""},null,{"$f":"IF(OR(G25=\"\",G25>EingabeAngabe!F30),\"F\",EingabeAngabe!B31)","v":"F"}]
[{"$f":"EingabeAngabe!B33","v":"SY25"},{"$f":"IF(EingabeAngabe!C33=\"\",\"\",EingabeAngabe!C33)","v":""},null,{"$f":"IF(EingabeAngabe!D33=\"\",\"\",EingabeAngabe!D33)","v":""},null,{"$f":"IF(OR(G26=\"\",G26>EingabeAngabe!F31),\"F\",EingabeAngabe!B33)","v":"F"}]
[{"$f":"EingabeAngabe!B34","v":"SY26"},{"$f":"IF(EingabeAngabe!C34=\"\",\"\",EingabeAngabe!C34)","v":""},null,{"$f":"IF(EingabeAngabe!D34=\"\",\"\",EingabeAngabe!D34)","v":""},null,{"$f":"IF(OR(G27=\"\",G27>EingabeAngabe!F32),\"F\",EingabeAngabe!B34)","v":"F"}]
[{"$f":"EingabeAngabe!B35","v":"SY27"},{"$f":"IF(EingabeAngabe!C35=\"\",\"\",EingabeAngabe!C35)","v":""},null,{"$f":"IF(EingabeAngabe!D35=\"\",\"\",EingabeAngabe!D35)","v":""},null,{"$f":"IF(OR(G28=\"\",G28>EingabeAngabe!F33),\"F\",EingabeAngabe!B35)","v":"F"},null,"Summe Übersetzungstext",null,null,null,null,{"$f":"EingabeAngabe!R39","v":""}]
[{"$f":"EingabeAngabe!B36","v":"SY28"},{"$f":"IF(EingabeAngabe!C36=\"\",\"\",EingabeAngabe!C36)","v":""},null,{"$f":"IF(EingabeAngabe!D36=\"\",\"\",EingabeAngabe!D36)","v":""},null,{"$f":"IF(OR(G29=\"\",G29>EingabeAngabe!F34),\"F\",EingabeAngabe!B36)","v":"F"},null,"Summe Arbeitsaufgaben und Interpretation",null,null,null,null,{"$f":"EingabeAngabe!R40","v":""}]
[null,{"$f":"EingabeAngabe!C37","v":"SPRACHLICHE QUALITÄT IN DER ZIELSPRACHE"},null,null,null,{"$f":"IF(OR(G30=1,G30=3,G30=5,G30>5),\"F\",\"4/2/0\")","v":"4/2/0"},null,"Gesamtsumme",null,null,null,null,{"$f":"EingabeAngabe!R2","v":""}]
[null,null,null,null,null,null,null,"NOTE",null,null,{"$f":"IF(EingabeAngabe!R3=1,\"Sehr gut\",IF(EingabeAngabe!R3=2,\"Gut\",IF(EingabeAngabe!R3=3,\"Befriedigend\",IF(EingabeAngabe!R3=4,\"Genügend\",IF(EingabeAngabe!R3=5,\"Nicht genügend\",\"\")))))","v":""}]

{"sheet":"Schueler13Punkte","index":16,"n_rows":31,"n_cols":13,"rows_kept":31,"cut":false,"hidden":false,"merged":[[28,1,28,2],[29,1,29,3],[29,7,29,11],[29,12,29,13],[30,7,30,9],[30,10,30,13],[27,7,27,11],[27,12,27,13],[28,3,28,4],[28,7,28,11],[28,12,28,13],[22,7,22,10],[23,1,23,2],[23,3,23,4],[23,7,26,13],[24,1,24,2],[24,3,24,4],[25,3,25,4],[26,3,26,4],[22,1,22,2],[22,3,22,4],[25,1,25,2],[26,1,26,2],[27,1,27,2],[27,3,27,4],[15,0,16,0],[15,1,15,4],[15,5,16,5],[15,6,16,6],[16,1,16,4],[13,7,13,13],[14,7,21,13],[17,1,17,2],[18,1,18,2],[19,1,19,2],[20,1,20,2],[21,1,21,2],[21,3,21,4],[13,0,14,0],[13,1,13,4],[13,5,14,5],[13,6,14,6],[14,1,14,4],[10,11,10,13],[11,7,11,10],[11,11,11,13],[12,7,12,10],[12,11,12,13],[7,7,7,13],[8,7,8,10],[8,11,8,13],[11,0,12,0],[11,1,11,4],[11,5,12,5],[11,6,12,6],[12,1,12,4],[9,0,10,0],[9,1,9,4],[9,5,10,5],[9,6,10,6],[10,1,10,4],[9,7,9,10],[9,11,9,13],[10,7,10,10],[5,0,6,0],[5,1,5,4],[5,5,6,5],[5,6,6,6],[5,8,5,11],[6,1,6,4],[6,8,6,11],[7,0,8,0],[7,1,7,4],[7,5,8,5],[7,6,8,6],[8,1,8,4],[0,0,0,1],[0,3,0,4],[0,7,0,11],[1,0,2,0],[1,1,1,4],[1,5,2,5],[1,6,2,6],[1,8,1,11],[2,1,2,4],[2,8,2,11],[3,0,4,0],[3,1,3,4],[3,5,4,5],[3,6,4,6],[3,8,3,11],[4,1,4,4],[4,8,4,11]]}
["Übersetzungstext",null,"Schülername",{"$f":"SchuelernamenEingabe!B14","v":0},null,null,null,"Arbeitsaufgaben/ Interpretation"]
[{"$f":"EingabeAngabe!B6","v":"SE1"},{"$f":"IF(EingabeAngabe!C6=\"\",\"\",EingabeAngabe!C6)","v":""},null,null,null,{"$f":"IF(OR(G2=\"\",G2>EingabeAngabe!F6),\"F\",EingabeAngabe!B6)","v":"F"},null,{"$f":"EingabeAngabe!B41","v":"IT1"},{"$f":"IF(EingabeAngabe!C41=\"\",\"\",EingabeAngabe!C41)","v":""},null,null,null,{"$f":"IF(N2>EingabeAngabe!F41,\"F\",IF(EingabeAngabe!F41=\"\",\"\",EingabeAngabe!F41))","v":4}]
[null,{"$f":"IF(EingabeAngabe!C7=\"\",\"\",EingabeAngabe!C7)","v":""},null,null,null,null,null,{"$f":"EingabeAngabe!B42","v":"IT2"},{"$f":"IF(EingabeAngabe!C42=\"\",\"\",EingabeAngabe!C42)","v":""},null,null,null,{"$f":"IF(N3>EingabeAngabe!F42,\"F\",IF(EingabeAngabe!F42=\"\",\"\",EingabeAngabe!F42))","v":4}]
[{"$f":"EingabeAngabe!B8","v":"SE2"},{"$f":"IF(EingabeAngabe!C8=\"\",\"\",EingabeAngabe!C8)","v":""},null,null,null,{"$f":"IF(OR(G4=\"\",G4>EingabeAngabe!F8),\"F\",EingabeAngabe!B8)","v":"F"},null,{"$f":"EingabeAngabe!B43","v":"IT3"},{"$f":"IF(EingabeAngabe!C43=\"\",\"\",EingabeAngabe!C43)","v":""},null,null,null,{"$f":"IF(N4>EingabeAngabe!F43,\"F\",IF(EingabeAngabe!F43=\"\",\"\",EingabeAngabe!F43))","v":2}]
[null,{"$f":"IF(EingabeAngabe!C9=\"\",\"\",EingabeAngabe!C9)","v":""},null,null,null,null,null,{"$f":"EingabeAngabe!B44","v":"IT4"},{"$f":"IF(EingabeAngabe!C44=\"\",\"\",EingabeAngabe!C44)","v":""},null,null,null,{"$f":"IF(N5>EingabeAngabe!F44,\"F\",IF(EingabeAngabe!F44=\"\",\"\",EingabeAngabe!F44))","v":2}]
[{"$f":"EingabeAngabe!B10","v":"SE3"},{"$f":"IF(EingabeAngabe!C10=\"\",\"\",EingabeAngabe!C10)","v":""},null,null,null,{"$f":"IF(OR(G6=\"\",G6>EingabeAngabe!F10),\"F\",EingabeAngabe!B10)","v":"F"},null,{"$f":"EingabeAngabe!B45","v":"IT5"},{"$f":"IF(EingabeAngabe!C45=\"\",\"\",EingabeAngabe!C45)","v":""},null,null,null,{"$f":"IF(N6>EingabeAngabe!F45,\"F\",IF(EingabeAngabe!F45=\"\",\"\",EingabeAngabe!F45))","v":2}]
[null,{"$f":"IF(EingabeAngabe!C11=\"\",\"\",EingabeAngabe!C11)","v":""},null,null,null,null,null,{"$f":"EingabeAngabe!B46","v":"IT6"},{"$f":"IF(EingabeAngabe!C46=\"\",\"\",EingabeAngabe!C46)","v":""},null,null,null,{"$f":"IF(N7>EingabeAngabe!F46,\"F\",IF(EingabeAngabe!F46=\"\",\"\",EingabeAngabe!F46))","v":2}]
[{"$f":"EingabeAngabe!B12","v":"SE4"},{"$f":"IF(EingabeAngabe!C12=\"\",\"\",EingabeAngabe!C12)","v":""},null,null,null,{"$f":"IF(OR(G8=\"\",G8>EingabeAngabe!F12),\"F\",EingabeAngabe!B12)","v":"F"},null,"Notenschlüssel:"]
[null,{"$f":"IF(EingabeAngabe!C13=\"\",\"\",EingabeAngabe!C13)","v":""},null,null,null,null,null,"Sehr gut",null,null,null,{"$f":"EingabeAngabe!F50","v":"40 - 36"}]
[{"$f":"EingabeAngabe!B14","v":"SE5"},{"$f":"IF(EingabeAngabe!C14=\"\",\"\",EingabeAngabe!C14)","v":""},null,null,null,{"$f":"IF(OR(G10=\"\",G10>EingabeAngabe!F14),\"F\",EingabeAngabe!B14)","v":"F"},null,"Gut",null,null,null,{"$f":"EingabeAngabe!F51","v":"35 - 31"}]
[null,{"$f":"IF(EingabeAngabe!C15=\"\",\"\",EingabeAngabe!C15)","v":""},null,null,null,null,null,"Befriedigend",null,null,null,{"$f":"EingabeAngabe!F52","v":"30 - 26"}]
[{"$f":"EingabeAngabe!B16","v":"SE6"},{"$f":"IF(EingabeAngabe!C16=\"\",\"\",EingabeAngabe!C16)","v":""},null,null,null,{"$f":"IF(OR(G12=\"\",G12>EingabeAngabe!F16),\"F\",EingabeAngabe!B16)","v":"F"},null,"Genügend",null,null,null,{"$f":"EingabeAngabe!F53","v":"25 - 20"}]
[null,{"$f":"IF(EingabeAngabe!C17=\"\",\"\",EingabeAngabe!C17)","v":""},null,null,null,null,null,"Nicht genügend",null,null,null,{"$f":"EingabeAngabe!F54","v":"19 - 00"}]
[{"$f":"EingabeAngabe!B18","v":"SE7"},{"$f":"IF(EingabeAngabe!C18=\"\",\"\",EingabeAngabe!C18)","v":""},null,null,null,{"$f":"IF(OR(G14=\"\",G14>EingabeAngabe!F18),\"F\",EingabeAngabe!B18)","v":"F"},null,{"$f":"CONCATENATE(\"Notendefinition laut LBVO$14:\",\"            \",K31)","v":"Notendefinition laut LBVO$14:            "}]
[null,{"$f":"IF(EingabeAngabe!C19=\"\",\"\",EingabeAngabe!C19)","v":""},null,null,null,null,null,{"$f":"VLOOKUP(K31,SchuelernamenEingabe!D2:'SchuelernamenEingabe'!E40,2,FALSE)","v":{"$error":"#N/A"}}]
[{"$f":"EingabeAngabe!B20","v":"SE8"},{"$f":"IF(EingabeAngabe!C20=\"\",\"\",EingabeAngabe!C20)","v":""},null,null,null,{"$f":"IF(OR(G16=\"\",G16>EingabeAngabe!F20),\"F\",EingabeAngabe!B20)","v":"F"}]
[null,{"$f":"IF(EingabeAngabe!C21=\"\",\"\",EingabeAngabe!C21)","v":""}]
[{"$f":"EingabeAngabe!B23","v":"LE13"},{"$f":"IF(EingabeAngabe!C23=\"\",\"\",EingabeAngabe!C23)","v":""},null,{"$f":"IF(EingabeAngabe!D23=\"\",\"\",EingabeAngabe!D23)","v":""},{"$f":"IF(EingabeAngabe!E23=\"\",\"\",EingabeAngabe!E23)","v":""},{"$f":"IF(OR(G18=\"\",G18>EingabeAngabe!F23),\"F\",EingabeAngabe!B23)","v":"F"}]
[{"$f":"EingabeAngabe!B24","v":"LE14"},{"$f":"IF(EingabeAngabe!C24=\"\",\"\",EingabeAngabe!C24)","v":""},null,{"$f":"IF(EingabeAngabe!D24=\"\",\"\",EingabeAngabe!D24)","v":""},{"$f":"IF(EingabeAngabe!E24=\"\",\"\",EingabeAngabe!E24)","v":""},{"$f":"IF(OR(G19=\"\",G19>EingabeAngabe!F24),\"F\",EingabeAngabe!B24)","v":"F"}]
[{"$f":"EingabeAngabe!B25","v":"LE15"},{"$f":"IF(EingabeAngabe!C25=\"\",\"\",EingabeAngabe!C25)","v":""},null,{"$f":"IF(EingabeAngabe!D25=\"\",\"\",EingabeAngabe!D25)","v":""},{"$f":"IF(EingabeAngabe!E25=\"\",\"\",EingabeAngabe!E25)","v":""},{"$f":"IF(OR(G20=\"\",G20>EingabeAngabe!F25),\"F\",EingabeAngabe!B25)","v":"F"}]
[{"$f":"EingabeAngabe!B26","v":"LE16"},{"$f":"IF(EingabeAngabe!C26=\"\",\"\",EingabeAngabe!C26)","v":""},null,{"$f":"IF(EingabeAngabe!D26=\"\",\"\",EingabeAngabe!D26)","v":""},{"$f":"IF(EingabeAngabe!E26=\"\",\"\",EingabeAngabe!E26)","v":""},{"$f":"IF(OR(G21=\"\",G21>EingabeAngabe!F26),\"F\",EingabeAngabe!B26)","v":"F"}]
[{"$f":"EingabeAngabe!B28","v":"MO19"},{"$f":"IF(EingabeAngabe!C28=\"\",\"\",EingabeAngabe!C28)","v":""},null,{"$f":"IF(EingabeAngabe!D28=\"\",\"\",EingabeAngabe!D28)","v":""},null,{"$f":"IF(OR(G22=\"\",G22>EingabeAngabe!F27),\"F\",EingabeAngabe!B28)","v":"F"}]
[{"$f":"EingabeAngabe!B29","v":"MO20"},{"$f":"IF(EingabeAngabe!C29=\"\",\"\",EingabeAngabe!C29)","v":""},null,{"$f":"IF(EingabeAngabe!D29=\"\",\"\",EingabeAngabe!D29)","v":""},null,{"$f":"IF(OR(G23=\"\",G23>EingabeAngabe!F28),\"F\",EingabeAngabe!B29)","v":"F"},null,{"$f":"IF(EingabeAngabe!F60>\"\",EingabeAngabe!E59,\"\")","v":"Eigener Notenkommentar:"}]
[{"$f":"EingabeAngabe!B30","v":"MO21"},{"$f":"IF(EingabeAngabe!C30=\"\",\"\",EingabeAngabe!C30)","v":""},null,{"$f":"IF(EingabeAngabe!D30=\"\",\"\",EingabeAngabe!D30)","v":""},null,{"$f":"IF(OR(G24=\"\",G24>EingabeAngabe!F29),\"F\",EingabeAngabe!B30)","v":"F"}]
[{"$f":"EingabeAngabe!B31","v":"MO22"},{"$f":"IF(EingabeAngabe!C31=\"\",\"\",EingabeAngabe!C31)","v":""},null,{"$f":"IF(EingabeAngabe!D31=\"\",\"\",EingabeAngabe!D31)","v":""},null,{"$f":"IF(OR(G25=\"\",G25>EingabeAngabe!F30),\"F\",EingabeAngabe!B31)","v":"F"}]
[{"$f":"EingabeAngabe!B33","v":"SY25"},{"$f":"IF(EingabeAngabe!C33=\"\",\"\",EingabeAngabe!C33)","v":""},null,{"$f":"IF(EingabeAngabe!D33=\"\",\"\",EingabeAngabe!D33)","v":""},null,{"$f":"IF(OR(G26=\"\",G26>EingabeAngabe!F31),\"F\",EingabeAngabe!B33)","v":"F"}]
[{"$f":"EingabeAngabe!B34","v":"SY26"},{"$f":"IF(EingabeAngabe!C34=\"\",\"\",EingabeAngabe!C34)","v":""},null,{"$f":"IF(EingabeAngabe!D34=\"\",\"\",EingabeAngabe!D34)","v":""},null,{"$f":"IF(OR(G27=\"\",G27>EingabeAngabe!F32),\"F\",EingabeAngabe!B34)","v":"F"}]
[{"$f":"EingabeAngabe!B35","v":"SY27"},{"$f":"IF(EingabeAngabe!C35=\"\",\"\",EingabeAngabe!C35)","v":""},null,{"$f":"IF(EingabeAngabe!D35=\"\",\"\",EingabeAngabe!D35)","v":""},null,{"$f":"IF(OR(G28=\"\",G28>EingabeAngabe!F33),\"F\",EingabeAngabe!B35)","v":"F"},null,"Summe Übersetzungstext",null,null,null,null,{"$f":"EingabeAngabe!S39","v":""}]
[{"$f":"EingabeAngabe!B36","v":"SY28"},{"$f":"IF(EingabeAngabe!C36=\"\",\"\",EingabeAngabe!C36)","v":""},null,{"$f":"IF(EingabeAngabe!D36=\"\",\"\",EingabeAngabe!D36)","v":""},null,{"$f":"IF(OR(G29=\"\",G29>EingabeAngabe!F34),\"F\",EingabeAngabe!B36)","v":"F"},null,"Summe Arbeitsaufgaben und Interpretation",null,null,null,null,{"$f":"EingabeAngabe!S40","v":""}]
[null,{"$f":"EingabeAngabe!C37","v":"SPRACHLICHE QUALITÄT IN DER ZIELSPRACHE"},null,null,null,{"$f":"IF(OR(G30=1,G30=3,G30=5,G30>5),\"F\",\"4/2/0\")","v":"4/2/0"},null,"Gesamtsumme",null,null,null,null,{"$f":"EingabeAngabe!S2","v":""}]
[null,null,null,null,null,null,null,"NOTE",null,null,{"$f":"IF(EingabeAngabe!S3=1,\"Sehr gut\",IF(EingabeAngabe!S3=2,\"Gut\",IF(EingabeAngabe!S3=3,\"Befriedigend\",IF(EingabeAngabe!S3=4,\"Genügend\",IF(EingabeAngabe!S3=5,\"Nicht genügend\",\"\")))))","v":""}]

{"sheet":"Schueler14Punkte","index":17,"n_rows":31,"n_cols":13,"rows_kept":31,"cut":false,"hidden":false,"merged":[[28,1,28,2],[29,1,29,3],[29,7,29,11],[29,12,29,13],[30,7,30,9],[30,10,30,13],[27,7,27,11],[27,12,27,13],[28,3,28,4],[28,7,28,11],[28,12,28,13],[22,7,22,10],[23,1,23,2],[23,3,23,4],[23,7,26,13],[24,1,24,2],[24,3,24,4],[25,3,25,4],[26,3,26,4],[22,1,22,2],[22,3,22,4],[25,1,25,2],[26,1,26,2],[27,1,27,2],[27,3,27,4],[15,0,16,0],[15,1,15,4],[15,5,16,5],[15,6,16,6],[16,1,16,4],[13,7,13,13],[14,7,21,13],[17,1,17,2],[18,1,18,2],[19,1,19,2],[20,1,20,2],[21,1,21,2],[21,3,21,4],[13,0,14,0],[13,1,13,4],[13,5,14,5],[13,6,14,6],[14,1,14,4],[10,11,10,13],[11,7,11,10],[11,11,11,13],[12,7,12,10],[12,11,12,13],[7,7,7,13],[8,7,8,10],[8,11,8,13],[11,0,12,0],[11,1,11,4],[11,5,12,5],[11,6,12,6],[12,1,12,4],[9,0,10,0],[9,1,9,4],[9,5,10,5],[9,6,10,6],[10,1,10,4],[9,7,9,10],[9,11,9,13],[10,7,10,10],[5,0,6,0],[5,1,5,4],[5,5,6,5],[5,6,6,6],[5,8,5,11],[6,1,6,4],[6,8,6,11],[7,0,8,0],[7,1,7,4],[7,5,8,5],[7,6,8,6],[8,1,8,4],[0,0,0,1],[0,3,0,4],[0,7,0,11],[1,0,2,0],[1,1,1,4],[1,5,2,5],[1,6,2,6],[1,8,1,11],[2,1,2,4],[2,8,2,11],[3,0,4,0],[3,1,3,4],[3,5,4,5],[3,6,4,6],[3,8,3,11],[4,1,4,4],[4,8,4,11]]}
["Übersetzungstext",null,"Schülername",{"$f":"SchuelernamenEingabe!B15","v":0},null,null,null,"Arbeitsaufgaben/ Interpretation"]
[{"$f":"EingabeAngabe!B6","v":"SE1"},{"$f":"IF(EingabeAngabe!C6=\"\",\"\",EingabeAngabe!C6)","v":""},null,null,null,{"$f":"IF(OR(G2=\"\",G2>EingabeAngabe!F6),\"F\",EingabeAngabe!B6)","v":"F"},null,{"$f":"EingabeAngabe!B41","v":"IT1"},{"$f":"IF(EingabeAngabe!C41=\"\",\"\",EingabeAngabe!C41)","v":""},null,null,null,{"$f":"IF(N2>EingabeAngabe!F41,\"F\",IF(EingabeAngabe!F41=\"\",\"\",EingabeAngabe!F41))","v":4}]
[null,{"$f":"IF(EingabeAngabe!C7=\"\",\"\",EingabeAngabe!C7)","v":""},null,null,null,null,null,{"$f":"EingabeAngabe!B42","v":"IT2"},{"$f":"IF(EingabeAngabe!C42=\"\",\"\",EingabeAngabe!C42)","v":""},null,null,null,{"$f":"IF(N3>EingabeAngabe!F42,\"F\",IF(EingabeAngabe!F42=\"\",\"\",EingabeAngabe!F42))","v":4}]
[{"$f":"EingabeAngabe!B8","v":"SE2"},{"$f":"IF(EingabeAngabe!C8=\"\",\"\",EingabeAngabe!C8)","v":""},null,null,null,{"$f":"IF(OR(G4=\"\",G4>EingabeAngabe!F8),\"F\",EingabeAngabe!B8)","v":"F"},null,{"$f":"EingabeAngabe!B43","v":"IT3"},{"$f":"IF(EingabeAngabe!C43=\"\",\"\",EingabeAngabe!C43)","v":""},null,null,null,{"$f":"IF(N4>EingabeAngabe!F43,\"F\",IF(EingabeAngabe!F43=\"\",\"\",EingabeAngabe!F43))","v":2}]
[null,{"$f":"IF(EingabeAngabe!C9=\"\",\"\",EingabeAngabe!C9)","v":""},null,null,null,null,null,{"$f":"EingabeAngabe!B44","v":"IT4"},{"$f":"IF(EingabeAngabe!C44=\"\",\"\",EingabeAngabe!C44)","v":""},null,null,null,{"$f":"IF(N5>EingabeAngabe!F44,\"F\",IF(EingabeAngabe!F44=\"\",\"\",EingabeAngabe!F44))","v":2}]
[{"$f":"EingabeAngabe!B10","v":"SE3"},{"$f":"IF(EingabeAngabe!C10=\"\",\"\",EingabeAngabe!C10)","v":""},null,null,null,{"$f":"IF(OR(G6=\"\",G6>EingabeAngabe!F10),\"F\",EingabeAngabe!B10)","v":"F"},null,{"$f":"EingabeAngabe!B45","v":"IT5"},{"$f":"IF(EingabeAngabe!C45=\"\",\"\",EingabeAngabe!C45)","v":""},null,null,null,{"$f":"IF(N6>EingabeAngabe!F45,\"F\",IF(EingabeAngabe!F45=\"\",\"\",EingabeAngabe!F45))","v":2}]
[null,{"$f":"IF(EingabeAngabe!C11=\"\",\"\",EingabeAngabe!C11)","v":""},null,null,null,null,null,{"$f":"EingabeAngabe!B46","v":"IT6"},{"$f":"IF(EingabeAngabe!C46=\"\",\"\",EingabeAngabe!C46)","v":""},null,null,null,{"$f":"IF(N7>EingabeAngabe!F46,\"F\",IF(EingabeAngabe!F46=\"\",\"\",EingabeAngabe!F46))","v":2}]
[{"$f":"EingabeAngabe!B12","v":"SE4"},{"$f":"IF(EingabeAngabe!C12=\"\",\"\",EingabeAngabe!C12)","v":""},null,null,null,{"$f":"IF(OR(G8=\"\",G8>EingabeAngabe!F12),\"F\",EingabeAngabe!B12)","v":"F"},null,"Notenschlüssel:"]
[null,{"$f":"IF(EingabeAngabe!C13=\"\",\"\",EingabeAngabe!C13)","v":""},null,null,null,null,null,"Sehr gut",null,null,null,{"$f":"EingabeAngabe!F50","v":"40 - 36"}]
[{"$f":"EingabeAngabe!B14","v":"SE5"},{"$f":"IF(EingabeAngabe!C14=\"\",\"\",EingabeAngabe!C14)","v":""},null,null,null,{"$f":"IF(OR(G10=\"\",G10>EingabeAngabe!F14),\"F\",EingabeAngabe!B14)","v":"F"},null,"Gut",null,null,null,{"$f":"EingabeAngabe!F51","v":"35 - 31"}]
[null,{"$f":"IF(EingabeAngabe!C15=\"\",\"\",EingabeAngabe!C15)","v":""},null,null,null,null,null,"Befriedigend",null,null,null,{"$f":"EingabeAngabe!F52","v":"30 - 26"}]
[{"$f":"EingabeAngabe!B16","v":"SE6"},{"$f":"IF(EingabeAngabe!C16=\"\",\"\",EingabeAngabe!C16)","v":""},null,null,null,{"$f":"IF(OR(G12=\"\",G12>EingabeAngabe!F16),\"F\",EingabeAngabe!B16)","v":"F"},null,"Genügend",null,null,null,{"$f":"EingabeAngabe!F53","v":"25 - 20"}]
[null,{"$f":"IF(EingabeAngabe!C17=\"\",\"\",EingabeAngabe!C17)","v":""},null,null,null,null,null,"Nicht genügend",null,null,null,{"$f":"EingabeAngabe!F54","v":"19 - 00"}]
[{"$f":"EingabeAngabe!B18","v":"SE7"},{"$f":"IF(EingabeAngabe!C18=\"\",\"\",EingabeAngabe!C18)","v":""},null,null,null,{"$f":"IF(OR(G14=\"\",G14>EingabeAngabe!F18),\"F\",EingabeAngabe!B18)","v":"F"},null,{"$f":"CONCATENATE(\"Notendefinition laut LBVO$14:\",\"            \",K31)","v":"Notendefinition laut LBVO$14:            "}]
[null,{"$f":"IF(EingabeAngabe!C19=\"\",\"\",EingabeAngabe!C19)","v":""},null,null,null,null,null,{"$f":"VLOOKUP(K31,SchuelernamenEingabe!D2:'SchuelernamenEingabe'!E40,2,FALSE)","v":{"$error":"#N/A"}}]
[{"$f":"EingabeAngabe!B20","v":"SE8"},{"$f":"IF(EingabeAngabe!C20=\"\",\"\",EingabeAngabe!C20)","v":""},null,null,null,{"$f":"IF(OR(G16=\"\",G16>EingabeAngabe!F20),\"F\",EingabeAngabe!B20)","v":"F"}]
[null,{"$f":"IF(EingabeAngabe!C21=\"\",\"\",EingabeAngabe!C21)","v":""}]
[{"$f":"EingabeAngabe!B23","v":"LE13"},{"$f":"IF(EingabeAngabe!C23=\"\",\"\",EingabeAngabe!C23)","v":""},null,{"$f":"IF(EingabeAngabe!D23=\"\",\"\",EingabeAngabe!D23)","v":""},{"$f":"IF(EingabeAngabe!E23=\"\",\"\",EingabeAngabe!E23)","v":""},{"$f":"IF(OR(G18=\"\",G18>EingabeAngabe!F23),\"F\",EingabeAngabe!B23)","v":"F"}]
[{"$f":"EingabeAngabe!B24","v":"LE14"},{"$f":"IF(EingabeAngabe!C24=\"\",\"\",EingabeAngabe!C24)","v":""},null,{"$f":"IF(EingabeAngabe!D24=\"\",\"\",EingabeAngabe!D24)","v":""},{"$f":"IF(EingabeAngabe!E24=\"\",\"\",EingabeAngabe!E24)","v":""},{"$f":"IF(OR(G19=\"\",G19>EingabeAngabe!F24),\"F\",EingabeAngabe!B24)","v":"F"}]
[{"$f":"EingabeAngabe!B25","v":"LE15"},{"$f":"IF(EingabeAngabe!C25=\"\",\"\",EingabeAngabe!C25)","v":""},null,{"$f":"IF(EingabeAngabe!D25=\"\",\"\",EingabeAngabe!D25)","v":""},{"$f":"IF(EingabeAngabe!E25=\"\",\"\",EingabeAngabe!E25)","v":""},{"$f":"IF(OR(G20=\"\",G20>EingabeAngabe!F25),\"F\",EingabeAngabe!B25)","v":"F"}]
[{"$f":"EingabeAngabe!B26","v":"LE16"},{"$f":"IF(EingabeAngabe!C26=\"\",\"\",EingabeAngabe!C26)","v":""},null,{"$f":"IF(EingabeAngabe!D26=\"\",\"\",EingabeAngabe!D26)","v":""},{"$f":"IF(EingabeAngabe!E26=\"\",\"\",EingabeAngabe!E26)","v":""},{"$f":"IF(OR(G21=\"\",G21>EingabeAngabe!F26),\"F\",EingabeAngabe!B26)","v":"F"}]
[{"$f":"EingabeAngabe!B28","v":"MO19"},{"$f":"IF(EingabeAngabe!C28=\"\",\"\",EingabeAngabe!C28)","v":""},null,{"$f":"IF(EingabeAngabe!D28=\"\",\"\",EingabeAngabe!D28)","v":""},null,{"$f":"IF(OR(G22=\"\",G22>EingabeAngabe!F27),\"F\",EingabeAngabe!B28)","v":"F"}]
[{"$f":"EingabeAngabe!B29","v":"MO20"},{"$f":"IF(EingabeAngabe!C29=\"\",\"\",EingabeAngabe!C29)","v":""},null,{"$f":"IF(EingabeAngabe!D29=\"\",\"\",EingabeAngabe!D29)","v":""},null,{"$f":"IF(OR(G23=\"\",G23>EingabeAngabe!F28),\"F\",EingabeAngabe!B29)","v":"F"},null,{"$f":"IF(EingabeAngabe!F60>\"\",EingabeAngabe!E59,\"\")","v":"Eigener Notenkommentar:"}]
[{"$f":"EingabeAngabe!B30","v":"MO21"},{"$f":"IF(EingabeAngabe!C30=\"\",\"\",EingabeAngabe!C30)","v":""},null,{"$f":"IF(EingabeAngabe!D30=\"\",\"\",EingabeAngabe!D30)","v":""},null,{"$f":"IF(OR(G24=\"\",G24>EingabeAngabe!F29),\"F\",EingabeAngabe!B30)","v":"F"}]
[{"$f":"EingabeAngabe!B31","v":"MO22"},{"$f":"IF(EingabeAngabe!C31=\"\",\"\",EingabeAngabe!C31)","v":""},null,{"$f":"IF(EingabeAngabe!D31=\"\",\"\",EingabeAngabe!D31)","v":""},null,{"$f":"IF(OR(G25=\"\",G25>EingabeAngabe!F30),\"F\",EingabeAngabe!B31)","v":"F"}]
[{"$f":"EingabeAngabe!B33","v":"SY25"},{"$f":"IF(EingabeAngabe!C33=\"\",\"\",EingabeAngabe!C33)","v":""},null,{"$f":"IF(EingabeAngabe!D33=\"\",\"\",EingabeAngabe!D33)","v":""},null,{"$f":"IF(OR(G26=\"\",G26>EingabeAngabe!F31),\"F\",EingabeAngabe!B33)","v":"F"}]
[{"$f":"EingabeAngabe!B34","v":"SY26"},{"$f":"IF(EingabeAngabe!C34=\"\",\"\",EingabeAngabe!C34)","v":""},null,{"$f":"IF(EingabeAngabe!D34=\"\",\"\",EingabeAngabe!D34)","v":""},null,{"$f":"IF(OR(G27=\"\",G27>EingabeAngabe!F32),\"F\",EingabeAngabe!B34)","v":"F"}]
[{"$f":"EingabeAngabe!B35","v":"SY27"},{"$f":"IF(EingabeAngabe!C35=\"\",\"\",EingabeAngabe!C35)","v":""},null,{"$f":"IF(EingabeAngabe!D35=\"\",\"\",EingabeAngabe!D35)","v":""},null,{"$f":"IF(OR(G28=\"\",G28>EingabeAngabe!F33),\"F\",EingabeAngabe!B35)","v":"F"},null,"Summe Übersetzungstext",null,null,null,null,{"$f":"EingabeAngabe!T39","v":""}]
[{"$f":"EingabeAngabe!B36","v":"SY28"},{"$f":"IF(EingabeAngabe!C36=\"\",\"\",EingabeAngabe!C36)","v":""},null,{"$f":"IF(EingabeAngabe!D36=\"\",\"\",EingabeAngabe!D36)","v":""},null,{"$f":"IF(OR(G29=\"\",G29>EingabeAngabe!F34),\"F\",EingabeAngabe!B36)","v":"F"},null,"Summe Arbeitsaufgaben und Interpretation",null,null,null,null,{"$f":"EingabeAngabe!T40","v":""}]
[null,{"$f":"EingabeAngabe!C37","v":"SPRACHLICHE QUALITÄT IN DER ZIELSPRACHE"},null,null,null,{"$f":"IF(OR(G30=1,G30=3,G30=5,G30>5),\"F\",\"4/2/0\")","v":"4/2/0"},null,"Gesamtsumme",null,null,null,null,{"$f":"EingabeAngabe!T2","v":""}]
[null,null,null,null,null,null,null,"NOTE",null,null,{"$f":"IF(EingabeAngabe!T3=1,\"Sehr gut\",IF(EingabeAngabe!T3=2,\"Gut\",IF(EingabeAngabe!T3=3,\"Befriedigend\",IF(EingabeAngabe!T3=4,\"Genügend\",IF(EingabeAngabe!T3=5,\"Nicht genügend\",\"\")))))","v":""}]

{"sheet":"Schueler15Punkte","index":18,"n_rows":31,"n_cols":13,"rows_kept":31,"cut":false,"hidden":false,"merged":[[28,1,28,2],[29,1,29,3],[29,7,29,11],[29,12,29,13],[30,7,30,9],[30,10,30,13],[27,7,27,11],[27,12,27,13],[28,3,28,4],[28,7,28,11],[28,12,28,13],[22,7,22,10],[23,1,23,2],[23,3,23,4],[23,7,26,13],[24,1,24,2],[24,3,24,4],[25,3,25,4],[26,3,26,4],[22,1,22,2],[22,3,22,4],[25,1,25,2],[26,1,26,2],[27,1,27,2],[27,3,27,4],[15,0,16,0],[15,1,15,4],[15,5,16,5],[15,6,16,6],[16,1,16,4],[13,7,13,13],[14,7,21,13],[17,1,17,2],[18,1,18,2],[19,1,19,2],[20,1,20,2],[21,1,21,2],[21,3,21,4],[13,0,14,0],[13,1,13,4],[13,5,14,5],[13,6,14,6],[14,1,14,4],[10,11,10,13],[11,7,11,10],[11,11,11,13],[12,7,12,10],[12,11,12,13],[7,7,7,13],[8,7,8,10],[8,11,8,13],[11,0,12,0],[11,1,11,4],[11,5,12,5],[11,6,12,6],[12,1,12,4],[9,0,10,0],[9,1,9,4],[9,5,10,5],[9,6,10,6],[10,1,10,4],[9,7,9,10],[9,11,9,13],[10,7,10,10],[5,0,6,0],[5,1,5,4],[5,5,6,5],[5,6,6,6],[5,8,5,11],[6,1,6,4],[6,8,6,11],[7,0,8,0],[7,1,7,4],[7,5,8,5],[7,6,8,6],[8,1,8,4],[0,0,0,1],[0,3,0,4],[0,7,0,11],[1,0,2,0],[1,1,1,4],[1,5,2,5],[1,6,2,6],[1,8,1,11],[2,1,2,4],[2,8,2,11],[3,0,4,0],[3,1,3,4],[3,5,4,5],[3,6,4,6],[3,8,3,11],[4,1,4,4],[4,8,4,11]]}
["Übersetzungstext",null,"Schülername",{"$f":"SchuelernamenEingabe!B16","v":0},null,null,null,"Arbeitsaufgaben/ Interpretation"]
[{"$f":"EingabeAngabe!B6","v":"SE1"},{"$f":"IF(EingabeAngabe!C6=\"\",\"\",EingabeAngabe!C6)","v":""},null,null,null,{"$f":"IF(OR(G2=\"\",G2>EingabeAngabe!F6),\"F\",EingabeAngabe!B6)","v":"F"},null,{"$f":"EingabeAngabe!B41","v":"IT1"},{"$f":"IF(EingabeAngabe!C41=\"\",\"\",EingabeAngabe!C41)","v":""},null,null,null,{"$f":"IF(N2>EingabeAngabe!F41,\"F\",IF(EingabeAngabe!F41=\"\",\"\",EingabeAngabe!F41))","v":4}]
[null,{"$f":"IF(EingabeAngabe!C7=\"\",\"\",EingabeAngabe!C7)","v":""},null,null,null,null,null,{"$f":"EingabeAngabe!B42","v":"IT2"},{"$f":"IF(EingabeAngabe!C42=\"\",\"\",EingabeAngabe!C42)","v":""},null,null,null,{"$f":"IF(N3>EingabeAngabe!F42,\"F\",IF(EingabeAngabe!F42=\"\",\"\",EingabeAngabe!F42))","v":4}]
[{"$f":"EingabeAngabe!B8","v":"SE2"},{"$f":"IF(EingabeAngabe!C8=\"\",\"\",EingabeAngabe!C8)","v":""},null,null,null,{"$f":"IF(OR(G4=\"\",G4>EingabeAngabe!F8),\"F\",EingabeAngabe!B8)","v":"F"},null,{"$f":"EingabeAngabe!B43","v":"IT3"},{"$f":"IF(EingabeAngabe!C43=\"\",\"\",EingabeAngabe!C43)","v":""},null,null,null,{"$f":"IF(N4>EingabeAngabe!F43,\"F\",IF(EingabeAngabe!F43=\"\",\"\",EingabeAngabe!F43))","v":2}]
[null,{"$f":"IF(EingabeAngabe!C9=\"\",\"\",EingabeAngabe!C9)","v":""},null,null,null,null,null,{"$f":"EingabeAngabe!B44","v":"IT4"},{"$f":"IF(EingabeAngabe!C44=\"\",\"\",EingabeAngabe!C44)","v":""},null,null,null,{"$f":"IF(N5>EingabeAngabe!F44,\"F\",IF(EingabeAngabe!F44=\"\",\"\",EingabeAngabe!F44))","v":2}]
[{"$f":"EingabeAngabe!B10","v":"SE3"},{"$f":"IF(EingabeAngabe!C10=\"\",\"\",EingabeAngabe!C10)","v":""},null,null,null,{"$f":"IF(OR(G6=\"\",G6>EingabeAngabe!F10),\"F\",EingabeAngabe!B10)","v":"F"},null,{"$f":"EingabeAngabe!B45","v":"IT5"},{"$f":"IF(EingabeAngabe!C45=\"\",\"\",EingabeAngabe!C45)","v":""},null,null,null,{"$f":"IF(N6>EingabeAngabe!F45,\"F\",IF(EingabeAngabe!F45=\"\",\"\",EingabeAngabe!F45))","v":2}]
[null,{"$f":"IF(EingabeAngabe!C11=\"\",\"\",EingabeAngabe!C11)","v":""},null,null,null,null,null,{"$f":"EingabeAngabe!B46","v":"IT6"},{"$f":"IF(EingabeAngabe!C46=\"\",\"\",EingabeAngabe!C46)","v":""},null,null,null,{"$f":"IF(N7>EingabeAngabe!F46,\"F\",IF(EingabeAngabe!F46=\"\",\"\",EingabeAngabe!F46))","v":2}]
[{"$f":"EingabeAngabe!B12","v":"SE4"},{"$f":"IF(EingabeAngabe!C12=\"\",\"\",EingabeAngabe!C12)","v":""},null,null,null,{"$f":"IF(OR(G8=\"\",G8>EingabeAngabe!F12),\"F\",EingabeAngabe!B12)","v":"F"},null,"Notenschlüssel:"]
[null,{"$f":"IF(EingabeAngabe!C13=\"\",\"\",EingabeAngabe!C13)","v":""},null,null,null,null,null,"Sehr gut",null,null,null,{"$f":"EingabeAngabe!F50","v":"40 - 36"}]
[{"$f":"EingabeAngabe!B14","v":"SE5"},{"$f":"IF(EingabeAngabe!C14=\"\",\"\",EingabeAngabe!C14)","v":""},null,null,null,{"$f":"IF(OR(G10=\"\",G10>EingabeAngabe!F14),\"F\",EingabeAngabe!B14)","v":"F"},null,"Gut",null,null,null,{"$f":"EingabeAngabe!F51","v":"35 - 31"}]
[null,{"$f":"IF(EingabeAngabe!C15=\"\",\"\",EingabeAngabe!C15)","v":""},null,null,null,null,null,"Befriedigend",null,null,null,{"$f":"EingabeAngabe!F52","v":"30 - 26"}]
[{"$f":"EingabeAngabe!B16","v":"SE6"},{"$f":"IF(EingabeAngabe!C16=\"\",\"\",EingabeAngabe!C16)","v":""},null,null,null,{"$f":"IF(OR(G12=\"\",G12>EingabeAngabe!F16),\"F\",EingabeAngabe!B16)","v":"F"},null,"Genügend",null,null,null,{"$f":"EingabeAngabe!F53","v":"25 - 20"}]
[null,{"$f":"IF(EingabeAngabe!C17=\"\",\"\",EingabeAngabe!C17)","v":""},null,null,null,null,null,"Nicht genügend",null,null,null,{"$f":"EingabeAngabe!F54","v":"19 - 00"}]
[{"$f":"EingabeAngabe!B18","v":"SE7"},{"$f":"IF(EingabeAngabe!C18=\"\",\"\",EingabeAngabe!C18)","v":""},null,null,null,{"$f":"IF(OR(G14=\"\",G14>EingabeAngabe!F18),\"F\",EingabeAngabe!B18)","v":"F"},null,{"$f":"CONCATENATE(\"Notendefinition laut LBVO$14:\",\"            \",K31)","v":"Notendefinition laut LBVO$14:            "}]
[null,{"$f":"IF(EingabeAngabe!C19=\"\",\"\",EingabeAngabe!C19)","v":""},null,null,null,null,null,{"$f":"VLOOKUP(K31,SchuelernamenEingabe!D2:'SchuelernamenEingabe'!E40,2,FALSE)","v":{"$error":"#N/A"}}]
[{"$f":"EingabeAngabe!B20","v":"SE8"},{"$f":"IF(EingabeAngabe!C20=\"\",\"\",EingabeAngabe!C20)","v":""},null,null,null,{"$f":"IF(OR(G16=\"\",G16>EingabeAngabe!F20),\"F\",EingabeAngabe!B20)","v":"F"}]
[null,{"$f":"IF(EingabeAngabe!C21=\"\",\"\",EingabeAngabe!C21)","v":""}]
[{"$f":"EingabeAngabe!B23","v":"LE13"},{"$f":"IF(EingabeAngabe!C23=\"\",\"\",EingabeAngabe!C23)","v":""},null,{"$f":"IF(EingabeAngabe!D23=\"\",\"\",EingabeAngabe!D23)","v":""},{"$f":"IF(EingabeAngabe!E23=\"\",\"\",EingabeAngabe!E23)","v":""},{"$f":"IF(OR(G18=\"\",G18>EingabeAngabe!F23),\"F\",EingabeAngabe!B23)","v":"F"}]
[{"$f":"EingabeAngabe!B24","v":"LE14"},{"$f":"IF(EingabeAngabe!C24=\"\",\"\",EingabeAngabe!C24)","v":""},null,{"$f":"IF(EingabeAngabe!D24=\"\",\"\",EingabeAngabe!D24)","v":""},{"$f":"IF(EingabeAngabe!E24=\"\",\"\",EingabeAngabe!E24)","v":""},{"$f":"IF(OR(G19=\"\",G19>EingabeAngabe!F24),\"F\",EingabeAngabe!B24)","v":"F"}]
[{"$f":"EingabeAngabe!B25","v":"LE15"},{"$f":"IF(EingabeAngabe!C25=\"\",\"\",EingabeAngabe!C25)","v":""},null,{"$f":"IF(EingabeAngabe!D25=\"\",\"\",EingabeAngabe!D25)","v":""},{"$f":"IF(EingabeAngabe!E25=\"\",\"\",EingabeAngabe!E25)","v":""},{"$f":"IF(OR(G20=\"\",G20>EingabeAngabe!F25),\"F\",EingabeAngabe!B25)","v":"F"}]
[{"$f":"EingabeAngabe!B26","v":"LE16"},{"$f":"IF(EingabeAngabe!C26=\"\",\"\",EingabeAngabe!C26)","v":""},null,{"$f":"IF(EingabeAngabe!D26=\"\",\"\",EingabeAngabe!D26)","v":""},{"$f":"IF(EingabeAngabe!E26=\"\",\"\",EingabeAngabe!E26)","v":""},{"$f":"IF(OR(G21=\"\",G21>EingabeAngabe!F26),\"F\",EingabeAngabe!B26)","v":"F"}]
[{"$f":"EingabeAngabe!B28","v":"MO19"},{"$f":"IF(EingabeAngabe!C28=\"\",\"\",EingabeAngabe!C28)","v":""},null,{"$f":"IF(EingabeAngabe!D28=\"\",\"\",EingabeAngabe!D28)","v":""},null,{"$f":"IF(OR(G22=\"\",G22>EingabeAngabe!F27),\"F\",EingabeAngabe!B28)","v":"F"}]
[{"$f":"EingabeAngabe!B29","v":"MO20"},{"$f":"IF(EingabeAngabe!C29=\"\",\"\",EingabeAngabe!C29)","v":""},null,{"$f":"IF(EingabeAngabe!D29=\"\",\"\",EingabeAngabe!D29)","v":""},null,{"$f":"IF(OR(G23=\"\",G23>EingabeAngabe!F28),\"F\",EingabeAngabe!B29)","v":"F"},null,{"$f":"IF(EingabeAngabe!F60>\"\",EingabeAngabe!E59,\"\")","v":"Eigener Notenkommentar:"}]
[{"$f":"EingabeAngabe!B30","v":"MO21"},{"$f":"IF(EingabeAngabe!C30=\"\",\"\",EingabeAngabe!C30)","v":""},null,{"$f":"IF(EingabeAngabe!D30=\"\",\"\",EingabeAngabe!D30)","v":""},null,{"$f":"IF(OR(G24=\"\",G24>EingabeAngabe!F29),\"F\",EingabeAngabe!B30)","v":"F"}]
[{"$f":"EingabeAngabe!B31","v":"MO22"},{"$f":"IF(EingabeAngabe!C31=\"\",\"\",EingabeAngabe!C31)","v":""},null,{"$f":"IF(EingabeAngabe!D31=\"\",\"\",EingabeAngabe!D31)","v":""},null,{"$f":"IF(OR(G25=\"\",G25>EingabeAngabe!F30),\"F\",EingabeAngabe!B31)","v":"F"}]
[{"$f":"EingabeAngabe!B33","v":"SY25"},{"$f":"IF(EingabeAngabe!C33=\"\",\"\",EingabeAngabe!C33)","v":""},null,{"$f":"IF(EingabeAngabe!D33=\"\",\"\",EingabeAngabe!D33)","v":""},null,{"$f":"IF(OR(G26=\"\",G26>EingabeAngabe!F31),\"F\",EingabeAngabe!B33)","v":"F"}]
[{"$f":"EingabeAngabe!B34","v":"SY26"},{"$f":"IF(EingabeAngabe!C34=\"\",\"\",EingabeAngabe!C34)","v":""},null,{"$f":"IF(EingabeAngabe!D34=\"\",\"\",EingabeAngabe!D34)","v":""},null,{"$f":"IF(OR(G27=\"\",G27>EingabeAngabe!F32),\"F\",EingabeAngabe!B34)","v":"F"}]
[{"$f":"EingabeAngabe!B35","v":"SY27"},{"$f":"IF(EingabeAngabe!C35=\"\",\"\",EingabeAngabe!C35)","v":""},null,{"$f":"IF(EingabeAngabe!D35=\"\",\"\",EingabeAngabe!D35)","v":""},null,{"$f":"IF(OR(G28=\"\",G28>EingabeAngabe!F33),\"F\",EingabeAngabe!B35)","v":"F"},null,"Summe Übersetzungstext",null,null,null,null,{"$f":"EingabeAngabe!U39","v":""}]
[{"$f":"EingabeAngabe!B36","v":"SY28"},{"$f":"IF(EingabeAngabe!C36=\"\",\"\",EingabeAngabe!C36)","v":""},null,{"$f":"IF(EingabeAngabe!D36=\"\",\"\",EingabeAngabe!D36)","v":""},null,{"$f":"IF(OR(G29=\"\",G29>EingabeAngabe!F34),\"F\",EingabeAngabe!B36)","v":"F"},null,"Summe Arbeitsaufgaben und Interpretation",null,null,null,null,{"$f":"EingabeAngabe!U40","v":""}]
[null,{"$f":"EingabeAngabe!C37","v":"SPRACHLICHE QUALITÄT IN DER ZIELSPRACHE"},null,null,null,{"$f":"IF(OR(G30=1,G30=3,G30=5,G30>5),\"F\",\"4/2/0\")","v":"4/2/0"},null,"Gesamtsumme",null,null,null,null,{"$f":"EingabeAngabe!U2","v":""}]
[null,null,null,null,null,null,null,"NOTE",null,null,{"$f":"IF(EingabeAngabe!U3=1,\"Sehr gut\",IF(EingabeAngabe!U3=2,\"Gut\",IF(EingabeAngabe!U3=3,\"Befriedigend\",IF(EingabeAngabe!U3=4,\"Genügend\",IF(EingabeAngabe!U3=5,\"Nicht genügend\",\"\")))))","v":""}]

{"sheet":"Schueler16Punkte","index":19,"n_rows":31,"n_cols":13,"rows_kept":31,"cut":false,"hidden":false,"merged":[[28,1,28,2],[29,1,29,3],[29,7,29,11],[29,12,29,13],[30,7,30,9],[30,10,30,13],[27,7,27,11],[27,12,27,13],[28,3,28,4],[28,7,28,11],[28,12,28,13],[22,7,22,10],[23,1,23,2],[23,3,23,4],[23,7,26,13],[24,1,24,2],[24,3,24,4],[25,3,25,4],[26,3,26,4],[22,1,22,2],[22,3,22,4],[25,1,25,2],[26,1,26,2],[27,1,27,2],[27,3,27,4],[15,0,16,0],[15,1,15,4],[15,5,16,5],[15,6,16,6],[16,1,16,4],[13,7,13,13],[14,7,21,13],[17,1,17,2],[18,1,18,2],[19,1,19,2],[20,1,20,2],[21,1,21,2],[21,3,21,4],[13,0,14,0],[13,1,13,4],[13,5,14,5],[13,6,14,6],[14,1,14,4],[10,11,10,13],[11,7,11,10],[11,11,11,13],[12,7,12,10],[12,11,12,13],[7,7,7,13],[8,7,8,10],[8,11,8,13],[11,0,12,0],[11,1,11,4],[11,5,12,5],[11,6,12,6],[12,1,12,4],[9,0,10,0],[9,1,9,4],[9,5,10,5],[9,6,10,6],[10,1,10,4],[9,7,9,10],[9,11,9,13],[10,7,10,10],[5,0,6,0],[5,1,5,4],[5,5,6,5],[5,6,6,6],[5,8,5,11],[6,1,6,4],[6,8,6,11],[7,0,8,0],[7,1,7,4],[7,5,8,5],[7,6,8,6],[8,1,8,4],[0,0,0,1],[0,3,0,4],[0,7,0,11],[1,0,2,0],[1,1,1,4],[1,5,2,5],[1,6,2,6],[1,8,1,11],[2,1,2,4],[2,8,2,11],[3,0,4,0],[3,1,3,4],[3,5,4,5],[3,6,4,6],[3,8,3,11],[4,1,4,4],[4,8,4,11]]}
["Übersetzungstext",null,"Schülername",{"$f":"SchuelernamenEingabe!B17","v":0},null,null,null,"Arbeitsaufgaben/ Interpretation"]
[{"$f":"EingabeAngabe!B6","v":"SE1"},{"$f":"IF(EingabeAngabe!C6=\"\",\"\",EingabeAngabe!C6)","v":""},null,null,null,{"$f":"IF(OR(G2=\"\",G2>EingabeAngabe!F6),\"F\",EingabeAngabe!B6)","v":"F"},null,{"$f":"EingabeAngabe!B41","v":"IT1"},{"$f":"IF(EingabeAngabe!C41=\"\",\"\",EingabeAngabe!C41)","v":""},null,null,null,{"$f":"IF(N2>EingabeAngabe!F41,\"F\",IF(EingabeAngabe!F41=\"\",\"\",EingabeAngabe!F41))","v":4}]
[null,{"$f":"IF(EingabeAngabe!C7=\"\",\"\",EingabeAngabe!C7)","v":""},null,null,null,null,null,{"$f":"EingabeAngabe!B42","v":"IT2"},{"$f":"IF(EingabeAngabe!C42=\"\",\"\",EingabeAngabe!C42)","v":""},null,null,null,{"$f":"IF(N3>EingabeAngabe!F42,\"F\",IF(EingabeAngabe!F42=\"\",\"\",EingabeAngabe!F42))","v":4}]
[{"$f":"EingabeAngabe!B8","v":"SE2"},{"$f":"IF(EingabeAngabe!C8=\"\",\"\",EingabeAngabe!C8)","v":""},null,null,null,{"$f":"IF(OR(G4=\"\",G4>EingabeAngabe!F8),\"F\",EingabeAngabe!B8)","v":"F"},null,{"$f":"EingabeAngabe!B43","v":"IT3"},{"$f":"IF(EingabeAngabe!C43=\"\",\"\",EingabeAngabe!C43)","v":""},null,null,null,{"$f":"IF(N4>EingabeAngabe!F43,\"F\",IF(EingabeAngabe!F43=\"\",\"\",EingabeAngabe!F43))","v":2}]
[null,{"$f":"IF(EingabeAngabe!C9=\"\",\"\",EingabeAngabe!C9)","v":""},null,null,null,null,null,{"$f":"EingabeAngabe!B44","v":"IT4"},{"$f":"IF(EingabeAngabe!C44=\"\",\"\",EingabeAngabe!C44)","v":""},null,null,null,{"$f":"IF(N5>EingabeAngabe!F44,\"F\",IF(EingabeAngabe!F44=\"\",\"\",EingabeAngabe!F44))","v":2}]
[{"$f":"EingabeAngabe!B10","v":"SE3"},{"$f":"IF(EingabeAngabe!C10=\"\",\"\",EingabeAngabe!C10)","v":""},null,null,null,{"$f":"IF(OR(G6=\"\",G6>EingabeAngabe!F10),\"F\",EingabeAngabe!B10)","v":"F"},null,{"$f":"EingabeAngabe!B45","v":"IT5"},{"$f":"IF(EingabeAngabe!C45=\"\",\"\",EingabeAngabe!C45)","v":""},null,null,null,{"$f":"IF(N6>EingabeAngabe!F45,\"F\",IF(EingabeAngabe!F45=\"\",\"\",EingabeAngabe!F45))","v":2}]
[null,{"$f":"IF(EingabeAngabe!C11=\"\",\"\",EingabeAngabe!C11)","v":""},null,null,null,null,null,{"$f":"EingabeAngabe!B46","v":"IT6"},{"$f":"IF(EingabeAngabe!C46=\"\",\"\",EingabeAngabe!C46)","v":""},null,null,null,{"$f":"IF(N7>EingabeAngabe!F46,\"F\",IF(EingabeAngabe!F46=\"\",\"\",EingabeAngabe!F46))","v":2}]
[{"$f":"EingabeAngabe!B12","v":"SE4"},{"$f":"IF(EingabeAngabe!C12=\"\",\"\",EingabeAngabe!C12)","v":""},null,null,null,{"$f":"IF(OR(G8=\"\",G8>EingabeAngabe!F12),\"F\",EingabeAngabe!B12)","v":"F"},null,"Notenschlüssel:"]
[null,{"$f":"IF(EingabeAngabe!C13=\"\",\"\",EingabeAngabe!C13)","v":""},null,null,null,null,null,"Sehr gut",null,null,null,{"$f":"EingabeAngabe!F50","v":"40 - 36"}]
[{"$f":"EingabeAngabe!B14","v":"SE5"},{"$f":"IF(EingabeAngabe!C14=\"\",\"\",EingabeAngabe!C14)","v":""},null,null,null,{"$f":"IF(OR(G10=\"\",G10>EingabeAngabe!F14),\"F\",EingabeAngabe!B14)","v":"F"},null,"Gut",null,null,null,{"$f":"EingabeAngabe!F51","v":"35 - 31"}]
[null,{"$f":"IF(EingabeAngabe!C15=\"\",\"\",EingabeAngabe!C15)","v":""},null,null,null,null,null,"Befriedigend",null,null,null,{"$f":"EingabeAngabe!F52","v":"30 - 26"}]
[{"$f":"EingabeAngabe!B16","v":"SE6"},{"$f":"IF(EingabeAngabe!C16=\"\",\"\",EingabeAngabe!C16)","v":""},null,null,null,{"$f":"IF(OR(G12=\"\",G12>EingabeAngabe!F16),\"F\",EingabeAngabe!B16)","v":"F"},null,"Genügend",null,null,null,{"$f":"EingabeAngabe!F53","v":"25 - 20"}]
[null,{"$f":"IF(EingabeAngabe!C17=\"\",\"\",EingabeAngabe!C17)","v":""},null,null,null,null,null,"Nicht genügend",null,null,null,{"$f":"EingabeAngabe!F54","v":"19 - 00"}]
[{"$f":"EingabeAngabe!B18","v":"SE7"},{"$f":"IF(EingabeAngabe!C18=\"\",\"\",EingabeAngabe!C18)","v":""},null,null,null,{"$f":"IF(OR(G14=\"\",G14>EingabeAngabe!F18),\"F\",EingabeAngabe!B18)","v":"F"},null,{"$f":"CONCATENATE(\"Notendefinition laut LBVO$14:\",\"            \",K31)","v":"Notendefinition laut LBVO$14:            "}]
[null,{"$f":"IF(EingabeAngabe!C19=\"\",\"\",EingabeAngabe!C19)","v":""},null,null,null,null,null,{"$f":"VLOOKUP(K31,SchuelernamenEingabe!D2:'SchuelernamenEingabe'!E40,2,FALSE)","v":{"$error":"#N/A"}}]
[{"$f":"EingabeAngabe!B20","v":"SE8"},{"$f":"IF(EingabeAngabe!C20=\"\",\"\",EingabeAngabe!C20)","v":""},null,null,null,{"$f":"IF(OR(G16=\"\",G16>EingabeAngabe!F20),\"F\",EingabeAngabe!B20)","v":"F"}]
[null,{"$f":"IF(EingabeAngabe!C21=\"\",\"\",EingabeAngabe!C21)","v":""}]
[{"$f":"EingabeAngabe!B23","v":"LE13"},{"$f":"IF(EingabeAngabe!C23=\"\",\"\",EingabeAngabe!C23)","v":""},null,{"$f":"IF(EingabeAngabe!D23=\"\",\"\",EingabeAngabe!D23)","v":""},{"$f":"IF(EingabeAngabe!E23=\"\",\"\",EingabeAngabe!E23)","v":""},{"$f":"IF(OR(G18=\"\",G18>EingabeAngabe!F23),\"F\",EingabeAngabe!B23)","v":"F"}]
[{"$f":"EingabeAngabe!B24","v":"LE14"},{"$f":"IF(EingabeAngabe!C24=\"\",\"\",EingabeAngabe!C24)","v":""},null,{"$f":"IF(EingabeAngabe!D24=\"\",\"\",EingabeAngabe!D24)","v":""},{"$f":"IF(EingabeAngabe!E24=\"\",\"\",EingabeAngabe!E24)","v":""},{"$f":"IF(OR(G19=\"\",G19>EingabeAngabe!F24),\"F\",EingabeAngabe!B24)","v":"F"}]
[{"$f":"EingabeAngabe!B25","v":"LE15"},{"$f":"IF(EingabeAngabe!C25=\"\",\"\",EingabeAngabe!C25)","v":""},null,{"$f":"IF(EingabeAngabe!D25=\"\",\"\",EingabeAngabe!D25)","v":""},{"$f":"IF(EingabeAngabe!E25=\"\",\"\",EingabeAngabe!E25)","v":""},{"$f":"IF(OR(G20=\"\",G20>EingabeAngabe!F25),\"F\",EingabeAngabe!B25)","v":"F"}]
[{"$f":"EingabeAngabe!B26","v":"LE16"},{"$f":"IF(EingabeAngabe!C26=\"\",\"\",EingabeAngabe!C26)","v":""},null,{"$f":"IF(EingabeAngabe!D26=\"\",\"\",EingabeAngabe!D26)","v":""},{"$f":"IF(EingabeAngabe!E26=\"\",\"\",EingabeAngabe!E26)","v":""},{"$f":"IF(OR(G21=\"\",G21>EingabeAngabe!F26),\"F\",EingabeAngabe!B26)","v":"F"}]
[{"$f":"EingabeAngabe!B28","v":"MO19"},{"$f":"IF(EingabeAngabe!C28=\"\",\"\",EingabeAngabe!C28)","v":""},null,{"$f":"IF(EingabeAngabe!D28=\"\",\"\",EingabeAngabe!D28)","v":""},null,{"$f":"IF(OR(G22=\"\",G22>EingabeAngabe!F27),\"F\",EingabeAngabe!B28)","v":"F"}]
[{"$f":"EingabeAngabe!B29","v":"MO20"},{"$f":"IF(EingabeAngabe!C29=\"\",\"\",EingabeAngabe!C29)","v":""},null,{"$f":"IF(EingabeAngabe!D29=\"\",\"\",EingabeAngabe!D29)","v":""},null,{"$f":"IF(OR(G23=\"\",G23>EingabeAngabe!F28),\"F\",EingabeAngabe!B29)","v":"F"},null,{"$f":"IF(EingabeAngabe!F60>\"\",EingabeAngabe!E59,\"\")","v":"Eigener Notenkommentar:"}]
[{"$f":"EingabeAngabe!B30","v":"MO21"},{"$f":"IF(EingabeAngabe!C30=\"\",\"\",EingabeAngabe!C30)","v":""},null,{"$f":"IF(EingabeAngabe!D30=\"\",\"\",EingabeAngabe!D30)","v":""},null,{"$f":"IF(OR(G24=\"\",G24>EingabeAngabe!F29),\"F\",EingabeAngabe!B30)","v":"F"}]
[{"$f":"EingabeAngabe!B31","v":"MO22"},{"$f":"IF(EingabeAngabe!C31=\"\",\"\",EingabeAngabe!C31)","v":""},null,{"$f":"IF(EingabeAngabe!D31=\"\",\"\",EingabeAngabe!D31)","v":""},null,{"$f":"IF(OR(G25=\"\",G25>EingabeAngabe!F30),\"F\",EingabeAngabe!B31)","v":"F"}]
[{"$f":"EingabeAngabe!B33","v":"SY25"},{"$f":"IF(EingabeAngabe!C33=\"\",\"\",EingabeAngabe!C33)","v":""},null,{"$f":"IF(EingabeAngabe!D33=\"\",\"\",EingabeAngabe!D33)","v":""},null,{"$f":"IF(OR(G26=\"\",G26>EingabeAngabe!F31),\"F\",EingabeAngabe!B33)","v":"F"}]
[{"$f":"EingabeAngabe!B34","v":"SY26"},{"$f":"IF(EingabeAngabe!C34=\"\",\"\",EingabeAngabe!C34)","v":""},null,{"$f":"IF(EingabeAngabe!D34=\"\",\"\",EingabeAngabe!D34)","v":""},null,{"$f":"IF(OR(G27=\"\",G27>EingabeAngabe!F32),\"F\",EingabeAngabe!B34)","v":"F"}]
[{"$f":"EingabeAngabe!B35","v":"SY27"},{"$f":"IF(EingabeAngabe!C35=\"\",\"\",EingabeAngabe!C35)","v":""},null,{"$f":"IF(EingabeAngabe!D35=\"\",\"\",EingabeAngabe!D35)","v":""},null,{"$f":"IF(OR(G28=\"\",G28>EingabeAngabe!F33),\"F\",EingabeAngabe!B35)","v":"F"},null,"Summe Übersetzungstext",null,null,null,null,{"$f":"EingabeAngabe!V39","v":""}]
[{"$f":"EingabeAngabe!B36","v":"SY28"},{"$f":"IF(EingabeAngabe!C36=\"\",\"\",EingabeAngabe!C36)","v":""},null,{"$f":"IF(EingabeAngabe!D36=\"\",\"\",EingabeAngabe!D36)","v":""},null,{"$f":"IF(OR(G29=\"\",G29>EingabeAngabe!F34),\"F\",EingabeAngabe!B36)","v":"F"},null,"Summe Arbeitsaufgaben und Interpretation",null,null,null,null,{"$f":"EingabeAngabe!V40","v":""}]
[null,{"$f":"EingabeAngabe!C37","v":"SPRACHLICHE QUALITÄT IN DER ZIELSPRACHE"},null,null,null,{"$f":"IF(OR(G30=1,G30=3,G30=5,G30>5),\"F\",\"4/2/0\")","v":"4/2/0"},null,"Gesamtsumme",null,null,null,null,{"$f":"EingabeAngabe!V2","v":""}]
[null,null,null,null,null,null,null,"NOTE",null,null,{"$f":"IF(EingabeAngabe!V3=1,\"Sehr gut\",IF(EingabeAngabe!V3=2,\"Gut\",IF(EingabeAngabe!V3=3,\"Befriedigend\",IF(EingabeAngabe!V3=4,\"Genügend\",IF(EingabeAngabe!V3=5,\"Nicht genügend\",\"\")))))","v":""}]

{"sheet":"Schueler17Punkte","index":20,"n_rows":31,"n_cols":13,"rows_kept":31,"cut":false,"hidden":false,"merged":[[28,1,28,2],[29,1,29,3],[29,7,29,11],[29,12,29,13],[30,7,30,9],[30,10,30,13],[27,7,27,11],[27,12,27,13],[28,3,28,4],[28,7,28,11],[28,12,28,13],[22,7,22,10],[23,1,23,2],[23,3,23,4],[23,7,26,13],[24,1,24,2],[24,3,24,4],[25,3,25,4],[26,3,26,4],[22,1,22,2],[22,3,22,4],[25,1,25,2],[26,1,26,2],[27,1,27,2],[27,3,27,4],[15,0,16,0],[15,1,15,4],[15,5,16,5],[15,6,16,6],[16,1,16,4],[13,7,13,13],[14,7,21,13],[17,1,17,2],[18,1,18,2],[19,1,19,2],[20,1,20,2],[21,1,21,2],[21,3,21,4],[13,0,14,0],[13,1,13,4],[13,5,14,5],[13,6,14,6],[14,1,14,4],[10,11,10,13],[11,7,11,10],[11,11,11,13],[12,7,12,10],[12,11,12,13],[7,7,7,13],[8,7,8,10],[8,11,8,13],[11,0,12,0],[11,1,11,4],[11,5,12,5],[11,6,12,6],[12,1,12,4],[9,0,10,0],[9,1,9,4],[9,5,10,5],[9,6,10,6],[10,1,10,4],[9,7,9,10],[9,11,9,13],[10,7,10,10],[5,0,6,0],[5,1,5,4],[5,5,6,5],[5,6,6,6],[5,8,5,11],[6,1,6,4],[6,8,6,11],[7,0,8,0],[7,1,7,4],[7,5,8,5],[7,6,8,6],[8,1,8,4],[0,0,0,1],[0,3,0,4],[0,7,0,11],[1,0,2,0],[1,1,1,4],[1,5,2,5],[1,6,2,6],[1,8,1,11],[2,1,2,4],[2,8,2,11],[3,0,4,0],[3,1,3,4],[3,5,4,5],[3,6,4,6],[3,8,3,11],[4,1,4,4],[4,8,4,11]]}
["Übersetzungstext",null,"Schülername",{"$f":"SchuelernamenEingabe!B18","v":0},null,null,null,"Arbeitsaufgaben/ Interpretation"]
[{"$f":"EingabeAngabe!B6","v":"SE1"},{"$f":"IF(EingabeAngabe!C6=\"\",\"\",EingabeAngabe!C6)","v":""},null,null,null,{"$f":"IF(OR(G2=\"\",G2>EingabeAngabe!F6),\"F\",EingabeAngabe!B6)","v":"F"},null,{"$f":"EingabeAngabe!B41","v":"IT1"},{"$f":"IF(EingabeAngabe!C41=\"\",\"\",EingabeAngabe!C41)","v":""},null,null,null,{"$f":"IF(N2>EingabeAngabe!F41,\"F\",IF(EingabeAngabe!F41=\"\",\"\",EingabeAngabe!F41))","v":4}]
[null,{"$f":"IF(EingabeAngabe!C7=\"\",\"\",EingabeAngabe!C7)","v":""},null,null,null,null,null,{"$f":"EingabeAngabe!B42","v":"IT2"},{"$f":"IF(EingabeAngabe!C42=\"\",\"\",EingabeAngabe!C42)","v":""},null,null,null,{"$f":"IF(N3>EingabeAngabe!F42,\"F\",IF(EingabeAngabe!F42=\"\",\"\",EingabeAngabe!F42))","v":4}]
[{"$f":"EingabeAngabe!B8","v":"SE2"},{"$f":"IF(EingabeAngabe!C8=\"\",\"\",EingabeAngabe!C8)","v":""},null,null,null,{"$f":"IF(OR(G4=\"\",G4>EingabeAngabe!F8),\"F\",EingabeAngabe!B8)","v":"F"},null,{"$f":"EingabeAngabe!B43","v":"IT3"},{"$f":"IF(EingabeAngabe!C43=\"\",\"\",EingabeAngabe!C43)","v":""},null,null,null,{"$f":"IF(N4>EingabeAngabe!F43,\"F\",IF(EingabeAngabe!F43=\"\",\"\",EingabeAngabe!F43))","v":2}]
[null,{"$f":"IF(EingabeAngabe!C9=\"\",\"\",EingabeAngabe!C9)","v":""},null,null,null,null,null,{"$f":"EingabeAngabe!B44","v":"IT4"},{"$f":"IF(EingabeAngabe!C44=\"\",\"\",EingabeAngabe!C44)","v":""},null,null,null,{"$f":"IF(N5>EingabeAngabe!F44,\"F\",IF(EingabeAngabe!F44=\"\",\"\",EingabeAngabe!F44))","v":2}]
[{"$f":"EingabeAngabe!B10","v":"SE3"},{"$f":"IF(EingabeAngabe!C10=\"\",\"\",EingabeAngabe!C10)","v":""},null,null,null,{"$f":"IF(OR(G6=\"\",G6>EingabeAngabe!F10),\"F\",EingabeAngabe!B10)","v":"F"},null,{"$f":"EingabeAngabe!B45","v":"IT5"},{"$f":"IF(EingabeAngabe!C45=\"\",\"\",EingabeAngabe!C45)","v":""},null,null,null,{"$f":"IF(N6>EingabeAngabe!F45,\"F\",IF(EingabeAngabe!F45=\"\",\"\",EingabeAngabe!F45))","v":2}]
[null,{"$f":"IF(EingabeAngabe!C11=\"\",\"\",EingabeAngabe!C11)","v":""},null,null,null,null,null,{"$f":"EingabeAngabe!B46","v":"IT6"},{"$f":"IF(EingabeAngabe!C46=\"\",\"\",EingabeAngabe!C46)","v":""},null,null,null,{"$f":"IF(N7>EingabeAngabe!F46,\"F\",IF(EingabeAngabe!F46=\"\",\"\",EingabeAngabe!F46))","v":2}]
[{"$f":"EingabeAngabe!B12","v":"SE4"},{"$f":"IF(EingabeAngabe!C12=\"\",\"\",EingabeAngabe!C12)","v":""},null,null,null,{"$f":"IF(OR(G8=\"\",G8>EingabeAngabe!F12),\"F\",EingabeAngabe!B12)","v":"F"},null,"Notenschlüssel:"]
[null,{"$f":"IF(EingabeAngabe!C13=\"\",\"\",EingabeAngabe!C13)","v":""},null,null,null,null,null,"Sehr gut",null,null,null,{"$f":"EingabeAngabe!F50","v":"40 - 36"}]
[{"$f":"EingabeAngabe!B14","v":"SE5"},{"$f":"IF(EingabeAngabe!C14=\"\",\"\",EingabeAngabe!C14)","v":""},null,null,null,{"$f":"IF(OR(G10=\"\",G10>EingabeAngabe!F14),\"F\",EingabeAngabe!B14)","v":"F"},null,"Gut",null,null,null,{"$f":"EingabeAngabe!F51","v":"35 - 31"}]
[null,{"$f":"IF(EingabeAngabe!C15=\"\",\"\",EingabeAngabe!C15)","v":""},null,null,null,null,null,"Befriedigend",null,null,null,{"$f":"EingabeAngabe!F52","v":"30 - 26"}]
[{"$f":"EingabeAngabe!B16","v":"SE6"},{"$f":"IF(EingabeAngabe!C16=\"\",\"\",EingabeAngabe!C16)","v":""},null,null,null,{"$f":"IF(OR(G12=\"\",G12>EingabeAngabe!F16),\"F\",EingabeAngabe!B16)","v":"F"},null,"Genügend",null,null,null,{"$f":"EingabeAngabe!F53","v":"25 - 20"}]
[null,{"$f":"IF(EingabeAngabe!C17=\"\",\"\",EingabeAngabe!C17)","v":""},null,null,null,null,null,"Nicht genügend",null,null,null,{"$f":"EingabeAngabe!F54","v":"19 - 00"}]
[{"$f":"EingabeAngabe!B18","v":"SE7"},{"$f":"IF(EingabeAngabe!C18=\"\",\"\",EingabeAngabe!C18)","v":""},null,null,null,{"$f":"IF(OR(G14=\"\",G14>EingabeAngabe!F18),\"F\",EingabeAngabe!B18)","v":"F"},null,{"$f":"CONCATENATE(\"Notendefinition laut LBVO$14:\",\"            \",K31)","v":"Notendefinition laut LBVO$14:            "}]
[null,{"$f":"IF(EingabeAngabe!C19=\"\",\"\",EingabeAngabe!C19)","v":""},null,null,null,null,null,{"$f":"VLOOKUP(K31,SchuelernamenEingabe!D2:'SchuelernamenEingabe'!E40,2,FALSE)","v":{"$error":"#N/A"}}]
[{"$f":"EingabeAngabe!B20","v":"SE8"},{"$f":"IF(EingabeAngabe!C20=\"\",\"\",EingabeAngabe!C20)","v":""},null,null,null,{"$f":"IF(OR(G16=\"\",G16>EingabeAngabe!F20),\"F\",EingabeAngabe!B20)","v":"F"}]
[null,{"$f":"IF(EingabeAngabe!C21=\"\",\"\",EingabeAngabe!C21)","v":""}]
[{"$f":"EingabeAngabe!B23","v":"LE13"},{"$f":"IF(EingabeAngabe!C23=\"\",\"\",EingabeAngabe!C23)","v":""},null,{"$f":"IF(EingabeAngabe!D23=\"\",\"\",EingabeAngabe!D23)","v":""},{"$f":"IF(EingabeAngabe!E23=\"\",\"\",EingabeAngabe!E23)","v":""},{"$f":"IF(OR(G18=\"\",G18>EingabeAngabe!F23),\"F\",EingabeAngabe!B23)","v":"F"}]
[{"$f":"EingabeAngabe!B24","v":"LE14"},{"$f":"IF(EingabeAngabe!C24=\"\",\"\",EingabeAngabe!C24)","v":""},null,{"$f":"IF(EingabeAngabe!D24=\"\",\"\",EingabeAngabe!D24)","v":""},{"$f":"IF(EingabeAngabe!E24=\"\",\"\",EingabeAngabe!E24)","v":""},{"$f":"IF(OR(G19=\"\",G19>EingabeAngabe!F24),\"F\",EingabeAngabe!B24)","v":"F"}]
[{"$f":"EingabeAngabe!B25","v":"LE15"},{"$f":"IF(EingabeAngabe!C25=\"\",\"\",EingabeAngabe!C25)","v":""},null,{"$f":"IF(EingabeAngabe!D25=\"\",\"\",EingabeAngabe!D25)","v":""},{"$f":"IF(EingabeAngabe!E25=\"\",\"\",EingabeAngabe!E25)","v":""},{"$f":"IF(OR(G20=\"\",G20>EingabeAngabe!F25),\"F\",EingabeAngabe!B25)","v":"F"}]
[{"$f":"EingabeAngabe!B26","v":"LE16"},{"$f":"IF(EingabeAngabe!C26=\"\",\"\",EingabeAngabe!C26)","v":""},null,{"$f":"IF(EingabeAngabe!D26=\"\",\"\",EingabeAngabe!D26)","v":""},{"$f":"IF(EingabeAngabe!E26=\"\",\"\",EingabeAngabe!E26)","v":""},{"$f":"IF(OR(G21=\"\",G21>EingabeAngabe!F26),\"F\",EingabeAngabe!B26)","v":"F"}]
[{"$f":"EingabeAngabe!B28","v":"MO19"},{"$f":"IF(EingabeAngabe!C28=\"\",\"\",EingabeAngabe!C28)","v":""},null,{"$f":"IF(EingabeAngabe!D28=\"\",\"\",EingabeAngabe!D28)","v":""},null,{"$f":"IF(OR(G22=\"\",G22>EingabeAngabe!F27),\"F\",EingabeAngabe!B28)","v":"F"}]
[{"$f":"EingabeAngabe!B29","v":"MO20"},{"$f":"IF(EingabeAngabe!C29=\"\",\"\",EingabeAngabe!C29)","v":""},null,{"$f":"IF(EingabeAngabe!D29=\"\",\"\",EingabeAngabe!D29)","v":""},null,{"$f":"IF(OR(G23=\"\",G23>EingabeAngabe!F28),\"F\",EingabeAngabe!B29)","v":"F"},null,{"$f":"IF(EingabeAngabe!F60>\"\",EingabeAngabe!E59,\"\")","v":"Eigener Notenkommentar:"}]
[{"$f":"EingabeAngabe!B30","v":"MO21"},{"$f":"IF(EingabeAngabe!C30=\"\",\"\",EingabeAngabe!C30)","v":""},null,{"$f":"IF(EingabeAngabe!D30=\"\",\"\",EingabeAngabe!D30)","v":""},null,{"$f":"IF(OR(G24=\"\",G24>EingabeAngabe!F29),\"F\",EingabeAngabe!B30)","v":"F"}]
[{"$f":"EingabeAngabe!B31","v":"MO22"},{"$f":"IF(EingabeAngabe!C31=\"\",\"\",EingabeAngabe!C31)","v":""},null,{"$f":"IF(EingabeAngabe!D31=\"\",\"\",EingabeAngabe!D31)","v":""},null,{"$f":"IF(OR(G25=\"\",G25>EingabeAngabe!F30),\"F\",EingabeAngabe!B31)","v":"F"}]
[{"$f":"EingabeAngabe!B33","v":"SY25"},{"$f":"IF(EingabeAngabe!C33=\"\",\"\",EingabeAngabe!C33)","v":""},null,{"$f":"IF(EingabeAngabe!D33=\"\",\"\",EingabeAngabe!D33)","v":""},null,{"$f":"IF(OR(G26=\"\",G26>EingabeAngabe!F31),\"F\",EingabeAngabe!B33)","v":"F"}]
[{"$f":"EingabeAngabe!B34","v":"SY26"},{"$f":"IF(EingabeAngabe!C34=\"\",\"\",EingabeAngabe!C34)","v":""},null,{"$f":"IF(EingabeAngabe!D34=\"\",\"\",EingabeAngabe!D34)","v":""},null,{"$f":"IF(OR(G27=\"\",G27>EingabeAngabe!F32),\"F\",EingabeAngabe!B34)","v":"F"}]
[{"$f":"EingabeAngabe!B35","v":"SY27"},{"$f":"IF(EingabeAngabe!C35=\"\",\"\",EingabeAngabe!C35)","v":""},null,{"$f":"IF(EingabeAngabe!D35=\"\",\"\",EingabeAngabe!D35)","v":""},null,{"$f":"IF(OR(G28=\"\",G28>EingabeAngabe!F33),\"F\",EingabeAngabe!B35)","v":"F"},null,"Summe Übersetzungstext",null,null,null,null,{"$f":"EingabeAngabe!W39","v":""}]
[{"$f":"EingabeAngabe!B36","v":"SY28"},{"$f":"IF(EingabeAngabe!C36=\"\",\"\",EingabeAngabe!C36)","v":""},null,{"$f":"IF(EingabeAngabe!D36=\"\",\"\",EingabeAngabe!D36)","v":""},null,{"$f":"IF(OR(G29=\"\",G29>EingabeAngabe!F34),\"F\",EingabeAngabe!B36)","v":"F"},null,"Summe Arbeitsaufgaben und Interpretation",null,null,null,null,{"$f":"EingabeAngabe!W40","v":""}]
[null,{"$f":"EingabeAngabe!C37","v":"SPRACHLICHE QUALITÄT IN DER ZIELSPRACHE"},null,null,null,{"$f":"IF(OR(G30=1,G30=3,G30=5,G30>5),\"F\",\"4/2/0\")","v":"4/2/0"},null,"Gesamtsumme",null,null,null,null,{"$f":"EingabeAngabe!W2","v":""}]
[null,null,null,null,null,null,null,"NOTE",null,null,{"$f":"IF(EingabeAngabe!W3=1,\"Sehr gut\",IF(EingabeAngabe!W3=2,\"Gut\",IF(EingabeAngabe!W3=3,\"Befriedigend\",IF(EingabeAngabe!W3=4,\"Genügend\",IF(EingabeAngabe!W3=5,\"Nicht genügend\",\"\")))))","v":""}]

{"sheet":"Schueler18Punkte","index":21,"n_rows":31,"n_cols":13,"rows_kept":31,"cut":false,"hidden":false,"merged":[[28,1,28,2],[29,1,29,3],[29,7,29,11],[29,12,29,13],[30,7,30,9],[30,10,30,13],[27,7,27,11],[27,12,27,13],[28,3,28,4],[28,7,28,11],[28,12,28,13],[22,7,22,10],[23,1,23,2],[23,3,23,4],[23,7,26,13],[24,1,24,2],[24,3,24,4],[25,3,25,4],[26,3,26,4],[22,1,22,2],[22,3,22,4],[25,1,25,2],[26,1,26,2],[27,1,27,2],[27,3,27,4],[15,0,16,0],[15,1,15,4],[15,5,16,5],[15,6,16,6],[16,1,16,4],[13,7,13,13],[14,7,21,13],[17,1,17,2],[18,1,18,2],[19,1,19,2],[20,1,20,2],[21,1,21,2],[21,3,21,4],[13,0,14,0],[13,1,13,4],[13,5,14,5],[13,6,14,6],[14,1,14,4],[10,11,10,13],[11,7,11,10],[11,11,11,13],[12,7,12,10],[12,11,12,13],[7,7,7,13],[8,7,8,10],[8,11,8,13],[11,0,12,0],[11,1,11,4],[11,5,12,5],[11,6,12,6],[12,1,12,4],[9,0,10,0],[9,1,9,4],[9,5,10,5],[9,6,10,6],[10,1,10,4],[9,7,9,10],[9,11,9,13],[10,7,10,10],[5,0,6,0],[5,1,5,4],[5,5,6,5],[5,6,6,6],[5,8,5,11],[6,1,6,4],[6,8,6,11],[7,0,8,0],[7,1,7,4],[7,5,8,5],[7,6,8,6],[8,1,8,4],[0,0,0,1],[0,3,0,4],[0,7,0,11],[1,0,2,0],[1,1,1,4],[1,5,2,5],[1,6,2,6],[1,8,1,11],[2,1,2,4],[2,8,2,11],[3,0,4,0],[3,1,3,4],[3,5,4,5],[3,6,4,6],[3,8,3,11],[4,1,4,4],[4,8,4,11]]}
["Übersetzungstext",null,"Schülername",{"$f":"SchuelernamenEingabe!B19","v":0},null,null,null,"Arbeitsaufgaben/ Interpretation"]
[{"$f":"EingabeAngabe!B6","v":"SE1"},{"$f":"IF(EingabeAngabe!C6=\"\",\"\",EingabeAngabe!C6)","v":""},null,null,null,{"$f":"IF(OR(G2=\"\",G2>EingabeAngabe!F6),\"F\",EingabeAngabe!B6)","v":"F"},null,{"$f":"EingabeAngabe!B41","v":"IT1"},{"$f":"IF(EingabeAngabe!C41=\"\",\"\",EingabeAngabe!C41)","v":""},null,null,null,{"$f":"IF(N2>EingabeAngabe!F41,\"F\",IF(EingabeAngabe!F41=\"\",\"\",EingabeAngabe!F41))","v":4}]
[null,{"$f":"IF(EingabeAngabe!C7=\"\",\"\",EingabeAngabe!C7)","v":""},null,null,null,null,null,{"$f":"EingabeAngabe!B42","v":"IT2"},{"$f":"IF(EingabeAngabe!C42=\"\",\"\",EingabeAngabe!C42)","v":""},null,null,null,{"$f":"IF(N3>EingabeAngabe!F42,\"F\",IF(EingabeAngabe!F42=\"\",\"\",EingabeAngabe!F42))","v":4}]
[{"$f":"EingabeAngabe!B8","v":"SE2"},{"$f":"IF(EingabeAngabe!C8=\"\",\"\",EingabeAngabe!C8)","v":""},null,null,null,{"$f":"IF(OR(G4=\"\",G4>EingabeAngabe!F8),\"F\",EingabeAngabe!B8)","v":"F"},null,{"$f":"EingabeAngabe!B43","v":"IT3"},{"$f":"IF(EingabeAngabe!C43=\"\",\"\",EingabeAngabe!C43)","v":""},null,null,null,{"$f":"IF(N4>EingabeAngabe!F43,\"F\",IF(EingabeAngabe!F43=\"\",\"\",EingabeAngabe!F43))","v":2}]
[null,{"$f":"IF(EingabeAngabe!C9=\"\",\"\",EingabeAngabe!C9)","v":""},null,null,null,null,null,{"$f":"EingabeAngabe!B44","v":"IT4"},{"$f":"IF(EingabeAngabe!C44=\"\",\"\",EingabeAngabe!C44)","v":""},null,null,null,{"$f":"IF(N5>EingabeAngabe!F44,\"F\",IF(EingabeAngabe!F44=\"\",\"\",EingabeAngabe!F44))","v":2}]
[{"$f":"EingabeAngabe!B10","v":"SE3"},{"$f":"IF(EingabeAngabe!C10=\"\",\"\",EingabeAngabe!C10)","v":""},null,null,null,{"$f":"IF(OR(G6=\"\",G6>EingabeAngabe!F10),\"F\",EingabeAngabe!B10)","v":"F"},null,{"$f":"EingabeAngabe!B45","v":"IT5"},{"$f":"IF(EingabeAngabe!C45=\"\",\"\",EingabeAngabe!C45)","v":""},null,null,null,{"$f":"IF(N6>EingabeAngabe!F45,\"F\",IF(EingabeAngabe!F45=\"\",\"\",EingabeAngabe!F45))","v":2}]
[null,{"$f":"IF(EingabeAngabe!C11=\"\",\"\",EingabeAngabe!C11)","v":""},null,null,null,null,null,{"$f":"EingabeAngabe!B46","v":"IT6"},{"$f":"IF(EingabeAngabe!C46=\"\",\"\",EingabeAngabe!C46)","v":""},null,null,null,{"$f":"IF(N7>EingabeAngabe!F46,\"F\",IF(EingabeAngabe!F46=\"\",\"\",EingabeAngabe!F46))","v":2}]
[{"$f":"EingabeAngabe!B12","v":"SE4"},{"$f":"IF(EingabeAngabe!C12=\"\",\"\",EingabeAngabe!C12)","v":""},null,null,null,{"$f":"IF(OR(G8=\"\",G8>EingabeAngabe!F12),\"F\",EingabeAngabe!B12)","v":"F"},null,"Notenschlüssel:"]
[null,{"$f":"IF(EingabeAngabe!C13=\"\",\"\",EingabeAngabe!C13)","v":""},null,null,null,null,null,"Sehr gut",null,null,null,{"$f":"EingabeAngabe!F50","v":"40 - 36"}]
[{"$f":"EingabeAngabe!B14","v":"SE5"},{"$f":"IF(EingabeAngabe!C14=\"\",\"\",EingabeAngabe!C14)","v":""},null,null,null,{"$f":"IF(OR(G10=\"\",G10>EingabeAngabe!F14),\"F\",EingabeAngabe!B14)","v":"F"},null,"Gut",null,null,null,{"$f":"EingabeAngabe!F51","v":"35 - 31"}]
[null,{"$f":"IF(EingabeAngabe!C15=\"\",\"\",EingabeAngabe!C15)","v":""},null,null,null,null,null,"Befriedigend",null,null,null,{"$f":"EingabeAngabe!F52","v":"30 - 26"}]
[{"$f":"EingabeAngabe!B16","v":"SE6"},{"$f":"IF(EingabeAngabe!C16=\"\",\"\",EingabeAngabe!C16)","v":""},null,null,null,{"$f":"IF(OR(G12=\"\",G12>EingabeAngabe!F16),\"F\",EingabeAngabe!B16)","v":"F"},null,"Genügend",null,null,null,{"$f":"EingabeAngabe!F53","v":"25 - 20"}]
[null,{"$f":"IF(EingabeAngabe!C17=\"\",\"\",EingabeAngabe!C17)","v":""},null,null,null,null,null,"Nicht genügend",null,null,null,{"$f":"EingabeAngabe!F54","v":"19 - 00"}]
[{"$f":"EingabeAngabe!B18","v":"SE7"},{"$f":"IF(EingabeAngabe!C18=\"\",\"\",EingabeAngabe!C18)","v":""},null,null,null,{"$f":"IF(OR(G14=\"\",G14>EingabeAngabe!F18),\"F\",EingabeAngabe!B18)","v":"F"},null,{"$f":"CONCATENATE(\"Notendefinition laut LBVO$14:\",\"            \",K31)","v":"Notendefinition laut LBVO$14:            "}]
[null,{"$f":"IF(EingabeAngabe!C19=\"\",\"\",EingabeAngabe!C19)","v":""},null,null,null,null,null,{"$f":"VLOOKUP(K31,SchuelernamenEingabe!D2:'SchuelernamenEingabe'!E40,2,FALSE)","v":{"$error":"#N/A"}}]
[{"$f":"EingabeAngabe!B20","v":"SE8"},{"$f":"IF(EingabeAngabe!C20=\"\",\"\",EingabeAngabe!C20)","v":""},null,null,null,{"$f":"IF(OR(G16=\"\",G16>EingabeAngabe!F20),\"F\",EingabeAngabe!B20)","v":"F"}]
[null,{"$f":"IF(EingabeAngabe!C21=\"\",\"\",EingabeAngabe!C21)","v":""}]
[{"$f":"EingabeAngabe!B23","v":"LE13"},{"$f":"IF(EingabeAngabe!C23=\"\",\"\",EingabeAngabe!C23)","v":""},null,{"$f":"IF(EingabeAngabe!D23=\"\",\"\",EingabeAngabe!D23)","v":""},{"$f":"IF(EingabeAngabe!E23=\"\",\"\",EingabeAngabe!E23)","v":""},{"$f":"IF(OR(G18=\"\",G18>EingabeAngabe!F23),\"F\",EingabeAngabe!B23)","v":"F"}]
[{"$f":"EingabeAngabe!B24","v":"LE14"},{"$f":"IF(EingabeAngabe!C24=\"\",\"\",EingabeAngabe!C24)","v":""},null,{"$f":"IF(EingabeAngabe!D24=\"\",\"\",EingabeAngabe!D24)","v":""},{"$f":"IF(EingabeAngabe!E24=\"\",\"\",EingabeAngabe!E24)","v":""},{"$f":"IF(OR(G19=\"\",G19>EingabeAngabe!F24),\"F\",EingabeAngabe!B24)","v":"F"}]
[{"$f":"EingabeAngabe!B25","v":"LE15"},{"$f":"IF(EingabeAngabe!C25=\"\",\"\",EingabeAngabe!C25)","v":""},null,{"$f":"IF(EingabeAngabe!D25=\"\",\"\",EingabeAngabe!D25)","v":""},{"$f":"IF(EingabeAngabe!E25=\"\",\"\",EingabeAngabe!E25)","v":""},{"$f":"IF(OR(G20=\"\",G20>EingabeAngabe!F25),\"F\",EingabeAngabe!B25)","v":"F"}]
[{"$f":"EingabeAngabe!B26","v":"LE16"},{"$f":"IF(EingabeAngabe!C26=\"\",\"\",EingabeAngabe!C26)","v":""},null,{"$f":"IF(EingabeAngabe!D26=\"\",\"\",EingabeAngabe!D26)","v":""},{"$f":"IF(EingabeAngabe!E26=\"\",\"\",EingabeAngabe!E26)","v":""},{"$f":"IF(OR(G21=\"\",G21>EingabeAngabe!F26),\"F\",EingabeAngabe!B26)","v":"F"}]
[{"$f":"EingabeAngabe!B28","v":"MO19"},{"$f":"IF(EingabeAngabe!C28=\"\",\"\",EingabeAngabe!C28)","v":""},null,{"$f":"IF(EingabeAngabe!D28=\"\",\"\",EingabeAngabe!D28)","v":""},null,{"$f":"IF(OR(G22=\"\",G22>EingabeAngabe!F27),\"F\",EingabeAngabe!B28)","v":"F"}]
[{"$f":"EingabeAngabe!B29","v":"MO20"},{"$f":"IF(EingabeAngabe!C29=\"\",\"\",EingabeAngabe!C29)","v":""},null,{"$f":"IF(EingabeAngabe!D29=\"\",\"\",EingabeAngabe!D29)","v":""},null,{"$f":"IF(OR(G23=\"\",G23>EingabeAngabe!F28),\"F\",EingabeAngabe!B29)","v":"F"},null,{"$f":"IF(EingabeAngabe!F60>\"\",EingabeAngabe!E59,\"\")","v":"Eigener Notenkommentar:"}]
[{"$f":"EingabeAngabe!B30","v":"MO21"},{"$f":"IF(EingabeAngabe!C30=\"\",\"\",EingabeAngabe!C30)","v":""},null,{"$f":"IF(EingabeAngabe!D30=\"\",\"\",EingabeAngabe!D30)","v":""},null,{"$f":"IF(OR(G24=\"\",G24>EingabeAngabe!F29),\"F\",EingabeAngabe!B30)","v":"F"}]
[{"$f":"EingabeAngabe!B31","v":"MO22"},{"$f":"IF(EingabeAngabe!C31=\"\",\"\",EingabeAngabe!C31)","v":""},null,{"$f":"IF(EingabeAngabe!D31=\"\",\"\",EingabeAngabe!D31)","v":""},null,{"$f":"IF(OR(G25=\"\",G25>EingabeAngabe!F30),\"F\",EingabeAngabe!B31)","v":"F"}]
[{"$f":"EingabeAngabe!B33","v":"SY25"},{"$f":"IF(EingabeAngabe!C33=\"\",\"\",EingabeAngabe!C33)","v":""},null,{"$f":"IF(EingabeAngabe!D33=\"\",\"\",EingabeAngabe!D33)","v":""},null,{"$f":"IF(OR(G26=\"\",G26>EingabeAngabe!F31),\"F\",EingabeAngabe!B33)","v":"F"}]
[{"$f":"EingabeAngabe!B34","v":"SY26"},{"$f":"IF(EingabeAngabe!C34=\"\",\"\",EingabeAngabe!C34)","v":""},null,{"$f":"IF(EingabeAngabe!D34=\"\",\"\",EingabeAngabe!D34)","v":""},null,{"$f":"IF(OR(G27=\"\",G27>EingabeAngabe!F32),\"F\",EingabeAngabe!B34)","v":"F"}]
[{"$f":"EingabeAngabe!B35","v":"SY27"},{"$f":"IF(EingabeAngabe!C35=\"\",\"\",EingabeAngabe!C35)","v":""},null,{"$f":"IF(EingabeAngabe!D35=\"\",\"\",EingabeAngabe!D35)","v":""},null,{"$f":"IF(OR(G28=\"\",G28>EingabeAngabe!F33),\"F\",EingabeAngabe!B35)","v":"F"},null,"Summe Übersetzungstext",null,null,null,null,{"$f":"EingabeAngabe!X39","v":""}]
[{"$f":"EingabeAngabe!B36","v":"SY28"},{"$f":"IF(EingabeAngabe!C36=\"\",\"\",EingabeAngabe!C36)","v":""},null,{"$f":"IF(EingabeAngabe!D36=\"\",\"\",EingabeAngabe!D36)","v":""},null,{"$f":"IF(OR(G29=\"\",G29>EingabeAngabe!F34),\"F\",EingabeAngabe!B36)","v":"F"},null,"Summe Arbeitsaufgaben und Interpretation",null,null,null,null,{"$f":"EingabeAngabe!X40","v":""}]
[null,{"$f":"EingabeAngabe!C37","v":"SPRACHLICHE QUALITÄT IN DER ZIELSPRACHE"},null,null,null,{"$f":"IF(OR(G30=1,G30=3,G30=5,G30>5),\"F\",\"4/2/0\")","v":"4/2/0"},null,"Gesamtsumme",null,null,null,null,{"$f":"EingabeAngabe!X2","v":""}]
[null,null,null,null,null,null,null,"NOTE",null,null,{"$f":"IF(EingabeAngabe!X3=1,\"Sehr gut\",IF(EingabeAngabe!X3=2,\"Gut\",IF(EingabeAngabe!X3=3,\"Befriedigend\",IF(EingabeAngabe!X3=4,\"Genügend\",IF(EingabeAngabe!X3=5,\"Nicht genügend\",\"\")))))","v":""}]

{"sheet":"Schueler19Punkte","index":22,"n_rows":31,"n_cols":13,"rows_kept":31,"cut":false,"hidden":false,"merged":[[28,1,28,2],[29,1,29,3],[29,7,29,11],[29,12,29,13],[30,7,30,9],[30,10,30,13],[27,7,27,11],[27,12,27,13],[28,3,28,4],[28,7,28,11],[28,12,28,13],[22,7,22,10],[23,1,23,2],[23,3,23,4],[23,7,26,13],[24,1,24,2],[24,3,24,4],[25,3,25,4],[26,3,26,4],[22,1,22,2],[22,3,22,4],[25,1,25,2],[26,1,26,2],[27,1,27,2],[27,3,27,4],[15,0,16,0],[15,1,15,4],[15,5,16,5],[15,6,16,6],[16,1,16,4],[13,7,13,13],[14,7,21,13],[17,1,17,2],[18,1,18,2],[19,1,19,2],[20,1,20,2],[21,1,21,2],[21,3,21,4],[13,0,14,0],[13,1,13,4],[13,5,14,5],[13,6,14,6],[14,1,14,4],[10,11,10,13],[11,7,11,10],[11,11,11,13],[12,7,12,10],[12,11,12,13],[7,7,7,13],[8,7,8,10],[8,11,8,13],[11,0,12,0],[11,1,11,4],[11,5,12,5],[11,6,12,6],[12,1,12,4],[9,0,10,0],[9,1,9,4],[9,5,10,5],[9,6,10,6],[10,1,10,4],[9,7,9,10],[9,11,9,13],[10,7,10,10],[5,0,6,0],[5,1,5,4],[5,5,6,5],[5,6,6,6],[5,8,5,11],[6,1,6,4],[6,8,6,11],[7,0,8,0],[7,1,7,4],[7,5,8,5],[7,6,8,6],[8,1,8,4],[0,0,0,1],[0,3,0,4],[0,7,0,11],[1,0,2,0],[1,1,1,4],[1,5,2,5],[1,6,2,6],[1,8,1,11],[2,1,2,4],[2,8,2,11],[3,0,4,0],[3,1,3,4],[3,5,4,5],[3,6,4,6],[3,8,3,11],[4,1,4,4],[4,8,4,11]]}
["Übersetzungstext",null,"Schülername",{"$f":"SchuelernamenEingabe!B20","v":0},null,null,null,"Arbeitsaufgaben/ Interpretation"]
[{"$f":"EingabeAngabe!B6","v":"SE1"},{"$f":"IF(EingabeAngabe!C6=\"\",\"\",EingabeAngabe!C6)","v":""},null,null,null,{"$f":"IF(OR(G2=\"\",G2>EingabeAngabe!F6),\"F\",EingabeAngabe!B6)","v":"F"},null,{"$f":"EingabeAngabe!B41","v":"IT1"},{"$f":"IF(EingabeAngabe!C41=\"\",\"\",EingabeAngabe!C41)","v":""},null,null,null,{"$f":"IF(N2>EingabeAngabe!F41,\"F\",IF(EingabeAngabe!F41=\"\",\"\",EingabeAngabe!F41))","v":4}]
[null,{"$f":"IF(EingabeAngabe!C7=\"\",\"\",EingabeAngabe!C7)","v":""},null,null,null,null,null,{"$f":"EingabeAngabe!B42","v":"IT2"},{"$f":"IF(EingabeAngabe!C42=\"\",\"\",EingabeAngabe!C42)","v":""},null,null,null,{"$f":"IF(N3>EingabeAngabe!F42,\"F\",IF(EingabeAngabe!F42=\"\",\"\",EingabeAngabe!F42))","v":4}]
[{"$f":"EingabeAngabe!B8","v":"SE2"},{"$f":"IF(EingabeAngabe!C8=\"\",\"\",EingabeAngabe!C8)","v":""},null,null,null,{"$f":"IF(OR(G4=\"\",G4>EingabeAngabe!F8),\"F\",EingabeAngabe!B8)","v":"F"},null,{"$f":"EingabeAngabe!B43","v":"IT3"},{"$f":"IF(EingabeAngabe!C43=\"\",\"\",EingabeAngabe!C43)","v":""},null,null,null,{"$f":"IF(N4>EingabeAngabe!F43,\"F\",IF(EingabeAngabe!F43=\"\",\"\",EingabeAngabe!F43))","v":2}]
[null,{"$f":"IF(EingabeAngabe!C9=\"\",\"\",EingabeAngabe!C9)","v":""},null,null,null,null,null,{"$f":"EingabeAngabe!B44","v":"IT4"},{"$f":"IF(EingabeAngabe!C44=\"\",\"\",EingabeAngabe!C44)","v":""},null,null,null,{"$f":"IF(N5>EingabeAngabe!F44,\"F\",IF(EingabeAngabe!F44=\"\",\"\",EingabeAngabe!F44))","v":2}]
[{"$f":"EingabeAngabe!B10","v":"SE3"},{"$f":"IF(EingabeAngabe!C10=\"\",\"\",EingabeAngabe!C10)","v":""},null,null,null,{"$f":"IF(OR(G6=\"\",G6>EingabeAngabe!F10),\"F\",EingabeAngabe!B10)","v":"F"},null,{"$f":"EingabeAngabe!B45","v":"IT5"},{"$f":"IF(EingabeAngabe!C45=\"\",\"\",EingabeAngabe!C45)","v":""},null,null,null,{"$f":"IF(N6>EingabeAngabe!F45,\"F\",IF(EingabeAngabe!F45=\"\",\"\",EingabeAngabe!F45))","v":2}]
[null,{"$f":"IF(EingabeAngabe!C11=\"\",\"\",EingabeAngabe!C11)","v":""},null,null,null,null,null,{"$f":"EingabeAngabe!B46","v":"IT6"},{"$f":"IF(EingabeAngabe!C46=\"\",\"\",EingabeAngabe!C46)","v":""},null,null,null,{"$f":"IF(N7>EingabeAngabe!F46,\"F\",IF(EingabeAngabe!F46=\"\",\"\",EingabeAngabe!F46))","v":2}]
[{"$f":"EingabeAngabe!B12","v":"SE4"},{"$f":"IF(EingabeAngabe!C12=\"\",\"\",EingabeAngabe!C12)","v":""},null,null,null,{"$f":"IF(OR(G8=\"\",G8>EingabeAngabe!F12),\"F\",EingabeAngabe!B12)","v":"F"},null,"Notenschlüssel:"]
[null,{"$f":"IF(EingabeAngabe!C13=\"\",\"\",EingabeAngabe!C13)","v":""},null,null,null,null,null,"Sehr gut",null,null,null,{"$f":"EingabeAngabe!F50","v":"40 - 36"}]
[{"$f":"EingabeAngabe!B14","v":"SE5"},{"$f":"IF(EingabeAngabe!C14=\"\",\"\",EingabeAngabe!C14)","v":""},null,null,null,{"$f":"IF(OR(G10=\"\",G10>EingabeAngabe!F14),\"F\",EingabeAngabe!B14)","v":"F"},null,"Gut",null,null,null,{"$f":"EingabeAngabe!F51","v":"35 - 31"}]
[null,{"$f":"IF(EingabeAngabe!C15=\"\",\"\",EingabeAngabe!C15)","v":""},null,null,null,null,null,"Befriedigend",null,null,null,{"$f":"EingabeAngabe!F52","v":"30 - 26"}]
[{"$f":"EingabeAngabe!B16","v":"SE6"},{"$f":"IF(EingabeAngabe!C16=\"\",\"\",EingabeAngabe!C16)","v":""},null,null,null,{"$f":"IF(OR(G12=\"\",G12>EingabeAngabe!F16),\"F\",EingabeAngabe!B16)","v":"F"},null,"Genügend",null,null,null,{"$f":"EingabeAngabe!F53","v":"25 - 20"}]
[null,{"$f":"IF(EingabeAngabe!C17=\"\",\"\",EingabeAngabe!C17)","v":""},null,null,null,null,null,"Nicht genügend",null,null,null,{"$f":"EingabeAngabe!F54","v":"19 - 00"}]
[{"$f":"EingabeAngabe!B18","v":"SE7"},{"$f":"IF(EingabeAngabe!C18=\"\",\"\",EingabeAngabe!C18)","v":""},null,null,null,{"$f":"IF(OR(G14=\"\",G14>EingabeAngabe!F18),\"F\",EingabeAngabe!B18)","v":"F"},null,{"$f":"CONCATENATE(\"Notendefinition laut LBVO$14:\",\"            \",K31)","v":"Notendefinition laut LBVO$14:            "}]
[null,{"$f":"IF(EingabeAngabe!C19=\"\",\"\",EingabeAngabe!C19)","v":""},null,null,null,null,null,{"$f":"VLOOKUP(K31,SchuelernamenEingabe!D2:'SchuelernamenEingabe'!E40,2,FALSE)","v":{"$error":"#N/A"}}]
[{"$f":"EingabeAngabe!B20","v":"SE8"},{"$f":"IF(EingabeAngabe!C20=\"\",\"\",EingabeAngabe!C20)","v":""},null,null,null,{"$f":"IF(OR(G16=\"\",G16>EingabeAngabe!F20),\"F\",EingabeAngabe!B20)","v":"F"}]
[null,{"$f":"IF(EingabeAngabe!C21=\"\",\"\",EingabeAngabe!C21)","v":""}]
[{"$f":"EingabeAngabe!B23","v":"LE13"},{"$f":"IF(EingabeAngabe!C23=\"\",\"\",EingabeAngabe!C23)","v":""},null,{"$f":"IF(EingabeAngabe!D23=\"\",\"\",EingabeAngabe!D23)","v":""},{"$f":"IF(EingabeAngabe!E23=\"\",\"\",EingabeAngabe!E23)","v":""},{"$f":"IF(OR(G18=\"\",G18>EingabeAngabe!F23),\"F\",EingabeAngabe!B23)","v":"F"}]
[{"$f":"EingabeAngabe!B24","v":"LE14"},{"$f":"IF(EingabeAngabe!C24=\"\",\"\",EingabeAngabe!C24)","v":""},null,{"$f":"IF(EingabeAngabe!D24=\"\",\"\",EingabeAngabe!D24)","v":""},{"$f":"IF(EingabeAngabe!E24=\"\",\"\",EingabeAngabe!E24)","v":""},{"$f":"IF(OR(G19=\"\",G19>EingabeAngabe!F24),\"F\",EingabeAngabe!B24)","v":"F"}]
[{"$f":"EingabeAngabe!B25","v":"LE15"},{"$f":"IF(EingabeAngabe!C25=\"\",\"\",EingabeAngabe!C25)","v":""},null,{"$f":"IF(EingabeAngabe!D25=\"\",\"\",EingabeAngabe!D25)","v":""},{"$f":"IF(EingabeAngabe!E25=\"\",\"\",EingabeAngabe!E25)","v":""},{"$f":"IF(OR(G20=\"\",G20>EingabeAngabe!F25),\"F\",EingabeAngabe!B25)","v":"F"}]
[{"$f":"EingabeAngabe!B26","v":"LE16"},{"$f":"IF(EingabeAngabe!C26=\"\",\"\",EingabeAngabe!C26)","v":""},null,{"$f":"IF(EingabeAngabe!D26=\"\",\"\",EingabeAngabe!D26)","v":""},{"$f":"IF(EingabeAngabe!E26=\"\",\"\",EingabeAngabe!E26)","v":""},{"$f":"IF(OR(G21=\"\",G21>EingabeAngabe!F26),\"F\",EingabeAngabe!B26)","v":"F"}]
[{"$f":"EingabeAngabe!B28","v":"MO19"},{"$f":"IF(EingabeAngabe!C28=\"\",\"\",EingabeAngabe!C28)","v":""},null,{"$f":"IF(EingabeAngabe!D28=\"\",\"\",EingabeAngabe!D28)","v":""},null,{"$f":"IF(OR(G22=\"\",G22>EingabeAngabe!F27),\"F\",EingabeAngabe!B28)","v":"F"}]
[{"$f":"EingabeAngabe!B29","v":"MO20"},{"$f":"IF(EingabeAngabe!C29=\"\",\"\",EingabeAngabe!C29)","v":""},null,{"$f":"IF(EingabeAngabe!D29=\"\",\"\",EingabeAngabe!D29)","v":""},null,{"$f":"IF(OR(G23=\"\",G23>EingabeAngabe!F28),\"F\",EingabeAngabe!B29)","v":"F"},null,{"$f":"IF(EingabeAngabe!F60>\"\",EingabeAngabe!E59,\"\")","v":"Eigener Notenkommentar:"}]
[{"$f":"EingabeAngabe!B30","v":"MO21"},{"$f":"IF(EingabeAngabe!C30=\"\",\"\",EingabeAngabe!C30)","v":""},null,{"$f":"IF(EingabeAngabe!D30=\"\",\"\",EingabeAngabe!D30)","v":""},null,{"$f":"IF(OR(G24=\"\",G24>EingabeAngabe!F29),\"F\",EingabeAngabe!B30)","v":"F"}]
[{"$f":"EingabeAngabe!B31","v":"MO22"},{"$f":"IF(EingabeAngabe!C31=\"\",\"\",EingabeAngabe!C31)","v":""},null,{"$f":"IF(EingabeAngabe!D31=\"\",\"\",EingabeAngabe!D31)","v":""},null,{"$f":"IF(OR(G25=\"\",G25>EingabeAngabe!F30),\"F\",EingabeAngabe!B31)","v":"F"}]
[{"$f":"EingabeAngabe!B33","v":"SY25"},{"$f":"IF(EingabeAngabe!C33=\"\",\"\",EingabeAngabe!C33)","v":""},null,{"$f":"IF(EingabeAngabe!D33=\"\",\"\",EingabeAngabe!D33)","v":""},null,{"$f":"IF(OR(G26=\"\",G26>EingabeAngabe!F31),\"F\",EingabeAngabe!B33)","v":"F"}]
[{"$f":"EingabeAngabe!B34","v":"SY26"},{"$f":"IF(EingabeAngabe!C34=\"\",\"\",EingabeAngabe!C34)","v":""},null,{"$f":"IF(EingabeAngabe!D34=\"\",\"\",EingabeAngabe!D34)","v":""},null,{"$f":"IF(OR(G27=\"\",G27>EingabeAngabe!F32),\"F\",EingabeAngabe!B34)","v":"F"}]
[{"$f":"EingabeAngabe!B35","v":"SY27"},{"$f":"IF(EingabeAngabe!C35=\"\",\"\",EingabeAngabe!C35)","v":""},null,{"$f":"IF(EingabeAngabe!D35=\"\",\"\",EingabeAngabe!D35)","v":""},null,{"$f":"IF(OR(G28=\"\",G28>EingabeAngabe!F33),\"F\",EingabeAngabe!B35)","v":"F"},null,"Summe Übersetzungstext",null,null,null,null,{"$f":"EingabeAngabe!Y39","v":""}]
[{"$f":"EingabeAngabe!B36","v":"SY28"},{"$f":"IF(EingabeAngabe!C36=\"\",\"\",EingabeAngabe!C36)","v":""},null,{"$f":"IF(EingabeAngabe!D36=\"\",\"\",EingabeAngabe!D36)","v":""},null,{"$f":"IF(OR(G29=\"\",G29>EingabeAngabe!F34),\"F\",EingabeAngabe!B36)","v":"F"},null,"Summe Arbeitsaufgaben und Interpretation",null,null,null,null,{"$f":"EingabeAngabe!Y40","v":""}]
[null,{"$f":"EingabeAngabe!C37","v":"SPRACHLICHE QUALITÄT IN DER ZIELSPRACHE"},null,null,null,{"$f":"IF(OR(G30=1,G30=3,G30=5,G30>5),\"F\",\"4/2/0\")","v":"4/2/0"},null,"Gesamtsumme",null,null,null,null,{"$f":"EingabeAngabe!Y2","v":""}]
[null,null,null,null,null,null,null,"NOTE",null,null,{"$f":"IF(EingabeAngabe!Y3=1,\"Sehr gut\",IF(EingabeAngabe!Y3=2,\"Gut\",IF(EingabeAngabe!Y3=3,\"Befriedigend\",IF(EingabeAngabe!Y3=4,\"Genügend\",IF(EingabeAngabe!Y3=5,\"Nicht genügend\",\"\")))))","v":""}]

{"sheet":"Schueler20Punkte","index":23,"n_rows":31,"n_cols":13,"rows_kept":31,"cut":false,"hidden":false,"merged":[[28,1,28,2],[29,1,29,3],[29,7,29,11],[29,12,29,13],[30,7,30,9],[30,10,30,13],[27,7,27,11],[27,12,27,13],[28,3,28,4],[28,7,28,11],[28,12,28,13],[22,7,22,10],[23,1,23,2],[23,3,23,4],[23,7,26,13],[24,1,24,2],[24,3,24,4],[25,3,25,4],[26,3,26,4],[22,1,22,2],[22,3,22,4],[25,1,25,2],[26,1,26,2],[27,1,27,2],[27,3,27,4],[15,0,16,0],[15,1,15,4],[15,5,16,5],[15,6,16,6],[16,1,16,4],[13,7,13,13],[14,7,21,13],[17,1,17,2],[18,1,18,2],[19,1,19,2],[20,1,20,2],[21,1,21,2],[21,3,21,4],[13,0,14,0],[13,1,13,4],[13,5,14,5],[13,6,14,6],[14,1,14,4],[10,11,10,13],[11,7,11,10],[11,11,11,13],[12,7,12,10],[12,11,12,13],[7,7,7,13],[8,7,8,10],[8,11,8,13],[11,0,12,0],[11,1,11,4],[11,5,12,5],[11,6,12,6],[12,1,12,4],[9,0,10,0],[9,1,9,4],[9,5,10,5],[9,6,10,6],[10,1,10,4],[9,7,9,10],[9,11,9,13],[10,7,10,10],[5,0,6,0],[5,1,5,4],[5,5,6,5],[5,6,6,6],[5,8,5,11],[6,1,6,4],[6,8,6,11],[7,0,8,0],[7,1,7,4],[7,5,8,5],[7,6,8,6],[8,1,8,4],[0,0,0,1],[0,3,0,4],[0,7,0,11],[1,0,2,0],[1,1,1,4],[1,5,2,5],[1,6,2,6],[1,8,1,11],[2,1,2,4],[2,8,2,11],[3,0,4,0],[3,1,3,4],[3,5,4,5],[3,6,4,6],[3,8,3,11],[4,1,4,4],[4,8,4,11]]}
["Übersetzungstext",null,"Schülername",{"$f":"SchuelernamenEingabe!B21","v":0},null,null,null,"Arbeitsaufgaben/ Interpretation"]
[{"$f":"EingabeAngabe!B6","v":"SE1"},{"$f":"IF(EingabeAngabe!C6=\"\",\"\",EingabeAngabe!C6)","v":""},null,null,null,{"$f":"IF(OR(G2=\"\",G2>EingabeAngabe!F6),\"F\",EingabeAngabe!B6)","v":"F"},null,{"$f":"EingabeAngabe!B41","v":"IT1"},{"$f":"IF(EingabeAngabe!C41=\"\",\"\",EingabeAngabe!C41)","v":""},null,null,null,{"$f":"IF(N2>EingabeAngabe!F41,\"F\",IF(EingabeAngabe!F41=\"\",\"\",EingabeAngabe!F41))","v":4}]
[null,{"$f":"IF(EingabeAngabe!C7=\"\",\"\",EingabeAngabe!C7)","v":""},null,null,null,null,null,{"$f":"EingabeAngabe!B42","v":"IT2"},{"$f":"IF(EingabeAngabe!C42=\"\",\"\",EingabeAngabe!C42)","v":""},null,null,null,{"$f":"IF(N3>EingabeAngabe!F42,\"F\",IF(EingabeAngabe!F42=\"\",\"\",EingabeAngabe!F42))","v":4}]
[{"$f":"EingabeAngabe!B8","v":"SE2"},{"$f":"IF(EingabeAngabe!C8=\"\",\"\",EingabeAngabe!C8)","v":""},null,null,null,{"$f":"IF(OR(G4=\"\",G4>EingabeAngabe!F8),\"F\",EingabeAngabe!B8)","v":"F"},null,{"$f":"EingabeAngabe!B43","v":"IT3"},{"$f":"IF(EingabeAngabe!C43=\"\",\"\",EingabeAngabe!C43)","v":""},null,null,null,{"$f":"IF(N4>EingabeAngabe!F43,\"F\",IF(EingabeAngabe!F43=\"\",\"\",EingabeAngabe!F43))","v":2}]
[null,{"$f":"IF(EingabeAngabe!C9=\"\",\"\",EingabeAngabe!C9)","v":""},null,null,null,null,null,{"$f":"EingabeAngabe!B44","v":"IT4"},{"$f":"IF(EingabeAngabe!C44=\"\",\"\",EingabeAngabe!C44)","v":""},null,null,null,{"$f":"IF(N5>EingabeAngabe!F44,\"F\",IF(EingabeAngabe!F44=\"\",\"\",EingabeAngabe!F44))","v":2}]
[{"$f":"EingabeAngabe!B10","v":"SE3"},{"$f":"IF(EingabeAngabe!C10=\"\",\"\",EingabeAngabe!C10)","v":""},null,null,null,{"$f":"IF(OR(G6=\"\",G6>EingabeAngabe!F10),\"F\",EingabeAngabe!B10)","v":"F"},null,{"$f":"EingabeAngabe!B45","v":"IT5"},{"$f":"IF(EingabeAngabe!C45=\"\",\"\",EingabeAngabe!C45)","v":""},null,null,null,{"$f":"IF(N6>EingabeAngabe!F45,\"F\",IF(EingabeAngabe!F45=\"\",\"\",EingabeAngabe!F45))","v":2}]
[null,{"$f":"IF(EingabeAngabe!C11=\"\",\"\",EingabeAngabe!C11)","v":""},null,null,null,null,null,{"$f":"EingabeAngabe!B46","v":"IT6"},{"$f":"IF(EingabeAngabe!C46=\"\",\"\",EingabeAngabe!C46)","v":""},null,null,null,{"$f":"IF(N7>EingabeAngabe!F46,\"F\",IF(EingabeAngabe!F46=\"\",\"\",EingabeAngabe!F46))","v":2}]
[{"$f":"EingabeAngabe!B12","v":"SE4"},{"$f":"IF(EingabeAngabe!C12=\"\",\"\",EingabeAngabe!C12)","v":""},null,null,null,{"$f":"IF(OR(G8=\"\",G8>EingabeAngabe!F12),\"F\",EingabeAngabe!B12)","v":"F"},null,"Notenschlüssel:"]
[null,{"$f":"IF(EingabeAngabe!C13=\"\",\"\",EingabeAngabe!C13)","v":""},null,null,null,null,null,"Sehr gut",null,null,null,{"$f":"EingabeAngabe!F50","v":"40 - 36"}]
[{"$f":"EingabeAngabe!B14","v":"SE5"},{"$f":"IF(EingabeAngabe!C14=\"\",\"\",EingabeAngabe!C14)","v":""},null,null,null,{"$f":"IF(OR(G10=\"\",G10>EingabeAngabe!F14),\"F\",EingabeAngabe!B14)","v":"F"},null,"Gut",null,null,null,{"$f":"EingabeAngabe!F51","v":"35 - 31"}]
[null,{"$f":"IF(EingabeAngabe!C15=\"\",\"\",EingabeAngabe!C15)","v":""},null,null,null,null,null,"Befriedigend",null,null,null,{"$f":"EingabeAngabe!F52","v":"30 - 26"}]
[{"$f":"EingabeAngabe!B16","v":"SE6"},{"$f":"IF(EingabeAngabe!C16=\"\",\"\",EingabeAngabe!C16)","v":""},null,null,null,{"$f":"IF(OR(G12=\"\",G12>EingabeAngabe!F16),\"F\",EingabeAngabe!B16)","v":"F"},null,"Genügend",null,null,null,{"$f":"EingabeAngabe!F53","v":"25 - 20"}]
[null,{"$f":"IF(EingabeAngabe!C17=\"\",\"\",EingabeAngabe!C17)","v":""},null,null,null,null,null,"Nicht genügend",null,null,null,{"$f":"EingabeAngabe!F54","v":"19 - 00"}]
[{"$f":"EingabeAngabe!B18","v":"SE7"},{"$f":"IF(EingabeAngabe!C18=\"\",\"\",EingabeAngabe!C18)","v":""},null,null,null,{"$f":"IF(OR(G14=\"\",G14>EingabeAngabe!F18),\"F\",EingabeAngabe!B18)","v":"F"},null,{"$f":"CONCATENATE(\"Notendefinition laut LBVO$14:\",\"            \",K31)","v":"Notendefinition laut LBVO$14:            "}]
[null,{"$f":"IF(EingabeAngabe!C19=\"\",\"\",EingabeAngabe!C19)","v":""},null,null,null,null,null,{"$f":"VLOOKUP(K31,SchuelernamenEingabe!D2:'SchuelernamenEingabe'!E40,2,FALSE)","v":{"$error":"#N/A"}}]
[{"$f":"EingabeAngabe!B20","v":"SE8"},{"$f":"IF(EingabeAngabe!C20=\"\",\"\",EingabeAngabe!C20)","v":""},null,null,null,{"$f":"IF(OR(G16=\"\",G16>EingabeAngabe!F20),\"F\",EingabeAngabe!B20)","v":"F"}]
[null,{"$f":"IF(EingabeAngabe!C21=\"\",\"\",EingabeAngabe!C21)","v":""}]
[{"$f":"EingabeAngabe!B23","v":"LE13"},{"$f":"IF(EingabeAngabe!C23=\"\",\"\",EingabeAngabe!C23)","v":""},null,{"$f":"IF(EingabeAngabe!D23=\"\",\"\",EingabeAngabe!D23)","v":""},{"$f":"IF(EingabeAngabe!E23=\"\",\"\",EingabeAngabe!E23)","v":""},{"$f":"IF(OR(G18=\"\",G18>EingabeAngabe!F23),\"F\",EingabeAngabe!B23)","v":"F"}]
[{"$f":"EingabeAngabe!B24","v":"LE14"},{"$f":"IF(EingabeAngabe!C24=\"\",\"\",EingabeAngabe!C24)","v":""},null,{"$f":"IF(EingabeAngabe!D24=\"\",\"\",EingabeAngabe!D24)","v":""},{"$f":"IF(EingabeAngabe!E24=\"\",\"\",EingabeAngabe!E24)","v":""},{"$f":"IF(OR(G19=\"\",G19>EingabeAngabe!F24),\"F\",EingabeAngabe!B24)","v":"F"}]
[{"$f":"EingabeAngabe!B25","v":"LE15"},{"$f":"IF(EingabeAngabe!C25=\"\",\"\",EingabeAngabe!C25)","v":""},null,{"$f":"IF(EingabeAngabe!D25=\"\",\"\",EingabeAngabe!D25)","v":""},{"$f":"IF(EingabeAngabe!E25=\"\",\"\",EingabeAngabe!E25)","v":""},{"$f":"IF(OR(G20=\"\",G20>EingabeAngabe!F25),\"F\",EingabeAngabe!B25)","v":"F"}]
[{"$f":"EingabeAngabe!B26","v":"LE16"},{"$f":"IF(EingabeAngabe!C26=\"\",\"\",EingabeAngabe!C26)","v":""},null,{"$f":"IF(EingabeAngabe!D26=\"\",\"\",EingabeAngabe!D26)","v":""},{"$f":"IF(EingabeAngabe!E26=\"\",\"\",EingabeAngabe!E26)","v":""},{"$f":"IF(OR(G21=\"\",G21>EingabeAngabe!F26),\"F\",EingabeAngabe!B26)","v":"F"}]
[{"$f":"EingabeAngabe!B28","v":"MO19"},{"$f":"IF(EingabeAngabe!C28=\"\",\"\",EingabeAngabe!C28)","v":""},null,{"$f":"IF(EingabeAngabe!D28=\"\",\"\",EingabeAngabe!D28)","v":""},null,{"$f":"IF(OR(G22=\"\",G22>EingabeAngabe!F27),\"F\",EingabeAngabe!B28)","v":"F"}]
[{"$f":"EingabeAngabe!B29","v":"MO20"},{"$f":"IF(EingabeAngabe!C29=\"\",\"\",EingabeAngabe!C29)","v":""},null,{"$f":"IF(EingabeAngabe!D29=\"\",\"\",EingabeAngabe!D29)","v":""},null,{"$f":"IF(OR(G23=\"\",G23>EingabeAngabe!F28),\"F\",EingabeAngabe!B29)","v":"F"},null,{"$f":"IF(EingabeAngabe!F60>\"\",EingabeAngabe!E59,\"\")","v":"Eigener Notenkommentar:"}]
[{"$f":"EingabeAngabe!B30","v":"MO21"},{"$f":"IF(EingabeAngabe!C30=\"\",\"\",EingabeAngabe!C30)","v":""},null,{"$f":"IF(EingabeAngabe!D30=\"\",\"\",EingabeAngabe!D30)","v":""},null,{"$f":"IF(OR(G24=\"\",G24>EingabeAngabe!F29),\"F\",EingabeAngabe!B30)","v":"F"}]
[{"$f":"EingabeAngabe!B31","v":"MO22"},{"$f":"IF(EingabeAngabe!C31=\"\",\"\",EingabeAngabe!C31)","v":""},null,{"$f":"IF(EingabeAngabe!D31=\"\",\"\",EingabeAngabe!D31)","v":""},null,{"$f":"IF(OR(G25=\"\",G25>EingabeAngabe!F30),\"F\",EingabeAngabe!B31)","v":"F"}]
[{"$f":"EingabeAngabe!B33","v":"SY25"},{"$f":"IF(EingabeAngabe!C33=\"\",\"\",EingabeAngabe!C33)","v":""},null,{"$f":"IF(EingabeAngabe!D33=\"\",\"\",EingabeAngabe!D33)","v":""},null,{"$f":"IF(OR(G26=\"\",G26>EingabeAngabe!F31),\"F\",EingabeAngabe!B33)","v":"F"}]
[{"$f":"EingabeAngabe!B34","v":"SY26"},{"$f":"IF(EingabeAngabe!C34=\"\",\"\",EingabeAngabe!C34)","v":""},null,{"$f":"IF(EingabeAngabe!D34=\"\",\"\",EingabeAngabe!D34)","v":""},null,{"$f":"IF(OR(G27=\"\",G27>EingabeAngabe!F32),\"F\",EingabeAngabe!B34)","v":"F"}]
[{"$f":"EingabeAngabe!B35","v":"SY27"},{"$f":"IF(EingabeAngabe!C35=\"\",\"\",EingabeAngabe!C35)","v":""},null,{"$f":"IF(EingabeAngabe!D35=\"\",\"\",EingabeAngabe!D35)","v":""},null,{"$f":"IF(OR(G28=\"\",G28>EingabeAngabe!F33),\"F\",EingabeAngabe!B35)","v":"F"},null,"Summe Übersetzungstext",null,null,null,null,{"$f":"EingabeAngabe!Z39","v":""}]
[{"$f":"EingabeAngabe!B36","v":"SY28"},{"$f":"IF(EingabeAngabe!C36=\"\",\"\",EingabeAngabe!C36)","v":""},null,{"$f":"IF(EingabeAngabe!D36=\"\",\"\",EingabeAngabe!D36)","v":""},null,{"$f":"IF(OR(G29=\"\",G29>EingabeAngabe!F34),\"F\",EingabeAngabe!B36)","v":"F"},null,"Summe Arbeitsaufgaben und Interpretation",null,null,null,null,{"$f":"EingabeAngabe!Z40","v":""}]
[null,{"$f":"EingabeAngabe!C37","v":"SPRACHLICHE QUALITÄT IN DER ZIELSPRACHE"},null,null,null,{"$f":"IF(OR(G30=1,G30=3,G30=5,G30>5),\"F\",\"4/2/0\")","v":"4/2/0"},null,"Gesamtsumme",null,null,null,null,{"$f":"EingabeAngabe!Z2","v":""}]
[null,null,null,null,null,null,null,"NOTE",null,null,{"$f":"IF(EingabeAngabe!Z3=1,\"Sehr gut\",IF(EingabeAngabe!Z3=2,\"Gut\",IF(EingabeAngabe!Z3=3,\"Befriedigend\",IF(EingabeAngabe!Z3=4,\"Genügend\",IF(EingabeAngabe!Z3=5,\"Nicht genügend\",\"\")))))","v":""}]

{"sheet":"Schueler21Punkte","index":24,"n_rows":31,"n_cols":13,"rows_kept":31,"cut":false,"hidden":false,"merged":[[28,1,28,2],[29,1,29,3],[29,7,29,11],[29,12,29,13],[30,7,30,9],[30,10,30,13],[27,7,27,11],[27,12,27,13],[28,3,28,4],[28,7,28,11],[28,12,28,13],[22,7,22,10],[23,1,23,2],[23,3,23,4],[23,7,26,13],[24,1,24,2],[24,3,24,4],[25,3,25,4],[26,3,26,4],[22,1,22,2],[22,3,22,4],[25,1,25,2],[26,1,26,2],[27,1,27,2],[27,3,27,4],[15,0,16,0],[15,1,15,4],[15,5,16,5],[15,6,16,6],[16,1,16,4],[13,7,13,13],[14,7,21,13],[17,1,17,2],[18,1,18,2],[19,1,19,2],[20,1,20,2],[21,1,21,2],[21,3,21,4],[13,0,14,0],[13,1,13,4],[13,5,14,5],[13,6,14,6],[14,1,14,4],[10,11,10,13],[11,7,11,10],[11,11,11,13],[12,7,12,10],[12,11,12,13],[7,7,7,13],[8,7,8,10],[8,11,8,13],[11,0,12,0],[11,1,11,4],[11,5,12,5],[11,6,12,6],[12,1,12,4],[9,0,10,0],[9,1,9,4],[9,5,10,5],[9,6,10,6],[10,1,10,4],[9,7,9,10],[9,11,9,13],[10,7,10,10],[5,0,6,0],[5,1,5,4],[5,5,6,5],[5,6,6,6],[5,8,5,11],[6,1,6,4],[6,8,6,11],[7,0,8,0],[7,1,7,4],[7,5,8,5],[7,6,8,6],[8,1,8,4],[0,0,0,1],[0,3,0,4],[0,7,0,11],[1,0,2,0],[1,1,1,4],[1,5,2,5],[1,6,2,6],[1,8,1,11],[2,1,2,4],[2,8,2,11],[3,0,4,0],[3,1,3,4],[3,5,4,5],[3,6,4,6],[3,8,3,11],[4,1,4,4],[4,8,4,11]]}
["Übersetzungstext",null,"Schülername",{"$f":"SchuelernamenEingabe!B22","v":0},null,null,null,"Arbeitsaufgaben/ Interpretation"]
[{"$f":"EingabeAngabe!B6","v":"SE1"},{"$f":"IF(EingabeAngabe!C6=\"\",\"\",EingabeAngabe!C6)","v":""},null,null,null,{"$f":"IF(OR(G2=\"\",G2>EingabeAngabe!F6),\"F\",EingabeAngabe!B6)","v":"F"},null,{"$f":"EingabeAngabe!B41","v":"IT1"},{"$f":"IF(EingabeAngabe!C41=\"\",\"\",EingabeAngabe!C41)","v":""},null,null,null,{"$f":"IF(N2>EingabeAngabe!F41,\"F\",IF(EingabeAngabe!F41=\"\",\"\",EingabeAngabe!F41))","v":4}]
[null,{"$f":"IF(EingabeAngabe!C7=\"\",\"\",EingabeAngabe!C7)","v":""},null,null,null,null,null,{"$f":"EingabeAngabe!B42","v":"IT2"},{"$f":"IF(EingabeAngabe!C42=\"\",\"\",EingabeAngabe!C42)","v":""},null,null,null,{"$f":"IF(N3>EingabeAngabe!F42,\"F\",IF(EingabeAngabe!F42=\"\",\"\",EingabeAngabe!F42))","v":4}]
[{"$f":"EingabeAngabe!B8","v":"SE2"},{"$f":"IF(EingabeAngabe!C8=\"\",\"\",EingabeAngabe!C8)","v":""},null,null,null,{"$f":"IF(OR(G4=\"\",G4>EingabeAngabe!F8),\"F\",EingabeAngabe!B8)","v":"F"},null,{"$f":"EingabeAngabe!B43","v":"IT3"},{"$f":"IF(EingabeAngabe!C43=\"\",\"\",EingabeAngabe!C43)","v":""},null,null,null,{"$f":"IF(N4>EingabeAngabe!F43,\"F\",IF(EingabeAngabe!F43=\"\",\"\",EingabeAngabe!F43))","v":2}]
[null,{"$f":"IF(EingabeAngabe!C9=\"\",\"\",EingabeAngabe!C9)","v":""},null,null,null,null,null,{"$f":"EingabeAngabe!B44","v":"IT4"},{"$f":"IF(EingabeAngabe!C44=\"\",\"\",EingabeAngabe!C44)","v":""},null,null,null,{"$f":"IF(N5>EingabeAngabe!F44,\"F\",IF(EingabeAngabe!F44=\"\",\"\",EingabeAngabe!F44))","v":2}]
[{"$f":"EingabeAngabe!B10","v":"SE3"},{"$f":"IF(EingabeAngabe!C10=\"\",\"\",EingabeAngabe!C10)","v":""},null,null,null,{"$f":"IF(OR(G6=\"\",G6>EingabeAngabe!F10),\"F\",EingabeAngabe!B10)","v":"F"},null,{"$f":"EingabeAngabe!B45","v":"IT5"},{"$f":"IF(EingabeAngabe!C45=\"\",\"\",EingabeAngabe!C45)","v":""},null,null,null,{"$f":"IF(N6>EingabeAngabe!F45,\"F\",IF(EingabeAngabe!F45=\"\",\"\",EingabeAngabe!F45))","v":2}]
[null,{"$f":"IF(EingabeAngabe!C11=\"\",\"\",EingabeAngabe!C11)","v":""},null,null,null,null,null,{"$f":"EingabeAngabe!B46","v":"IT6"},{"$f":"IF(EingabeAngabe!C46=\"\",\"\",EingabeAngabe!C46)","v":""},null,null,null,{"$f":"IF(N7>EingabeAngabe!F46,\"F\",IF(EingabeAngabe!F46=\"\",\"\",EingabeAngabe!F46))","v":2}]
[{"$f":"EingabeAngabe!B12","v":"SE4"},{"$f":"IF(EingabeAngabe!C12=\"\",\"\",EingabeAngabe!C12)","v":""},null,null,null,{"$f":"IF(OR(G8=\"\",G8>EingabeAngabe!F12),\"F\",EingabeAngabe!B12)","v":"F"},null,"Notenschlüssel:"]
[null,{"$f":"IF(EingabeAngabe!C13=\"\",\"\",EingabeAngabe!C13)","v":""},null,null,null,null,null,"Sehr gut",null,null,null,{"$f":"EingabeAngabe!F50","v":"40 - 36"}]
[{"$f":"EingabeAngabe!B14","v":"SE5"},{"$f":"IF(EingabeAngabe!C14=\"\",\"\",EingabeAngabe!C14)","v":""},null,null,null,{"$f":"IF(OR(G10=\"\",G10>EingabeAngabe!F14),\"F\",EingabeAngabe!B14)","v":"F"},null,"Gut",null,null,null,{"$f":"EingabeAngabe!F51","v":"35 - 31"}]
[null,{"$f":"IF(EingabeAngabe!C15=\"\",\"\",EingabeAngabe!C15)","v":""},null,null,null,null,null,"Befriedigend",null,null,null,{"$f":"EingabeAngabe!F52","v":"30 - 26"}]
[{"$f":"EingabeAngabe!B16","v":"SE6"},{"$f":"IF(EingabeAngabe!C16=\"\",\"\",EingabeAngabe!C16)","v":""},null,null,null,{"$f":"IF(OR(G12=\"\",G12>EingabeAngabe!F16),\"F\",EingabeAngabe!B16)","v":"F"},null,"Genügend",null,null,null,{"$f":"EingabeAngabe!F53","v":"25 - 20"}]
[null,{"$f":"IF(EingabeAngabe!C17=\"\",\"\",EingabeAngabe!C17)","v":""},null,null,null,null,null,"Nicht genügend",null,null,null,{"$f":"EingabeAngabe!F54","v":"19 - 00"}]
[{"$f":"EingabeAngabe!B18","v":"SE7"},{"$f":"IF(EingabeAngabe!C18=\"\",\"\",EingabeAngabe!C18)","v":""},null,null,null,{"$f":"IF(OR(G14=\"\",G14>EingabeAngabe!F18),\"F\",EingabeAngabe!B18)","v":"F"},null,{"$f":"CONCATENATE(\"Notendefinition laut LBVO$14:\",\"            \",K31)","v":"Notendefinition laut LBVO$14:            "}]
[null,{"$f":"IF(EingabeAngabe!C19=\"\",\"\",EingabeAngabe!C19)","v":""},null,null,null,null,null,{"$f":"VLOOKUP(K31,SchuelernamenEingabe!D2:'SchuelernamenEingabe'!E40,2,FALSE)","v":{"$error":"#N/A"}}]
[{"$f":"EingabeAngabe!B20","v":"SE8"},{"$f":"IF(EingabeAngabe!C20=\"\",\"\",EingabeAngabe!C20)","v":""},null,null,null,{"$f":"IF(OR(G16=\"\",G16>EingabeAngabe!F20),\"F\",EingabeAngabe!B20)","v":"F"}]
[null,{"$f":"IF(EingabeAngabe!C21=\"\",\"\",EingabeAngabe!C21)","v":""}]
[{"$f":"EingabeAngabe!B23","v":"LE13"},{"$f":"IF(EingabeAngabe!C23=\"\",\"\",EingabeAngabe!C23)","v":""},null,{"$f":"IF(EingabeAngabe!D23=\"\",\"\",EingabeAngabe!D23)","v":""},{"$f":"IF(EingabeAngabe!E23=\"\",\"\",EingabeAngabe!E23)","v":""},{"$f":"IF(OR(G18=\"\",G18>EingabeAngabe!F23),\"F\",EingabeAngabe!B23)","v":"F"}]
[{"$f":"EingabeAngabe!B24","v":"LE14"},{"$f":"IF(EingabeAngabe!C24=\"\",\"\",EingabeAngabe!C24)","v":""},null,{"$f":"IF(EingabeAngabe!D24=\"\",\"\",EingabeAngabe!D24)","v":""},{"$f":"IF(EingabeAngabe!E24=\"\",\"\",EingabeAngabe!E24)","v":""},{"$f":"IF(OR(G19=\"\",G19>EingabeAngabe!F24),\"F\",EingabeAngabe!B24)","v":"F"}]
[{"$f":"EingabeAngabe!B25","v":"LE15"},{"$f":"IF(EingabeAngabe!C25=\"\",\"\",EingabeAngabe!C25)","v":""},null,{"$f":"IF(EingabeAngabe!D25=\"\",\"\",EingabeAngabe!D25)","v":""},{"$f":"IF(EingabeAngabe!E25=\"\",\"\",EingabeAngabe!E25)","v":""},{"$f":"IF(OR(G20=\"\",G20>EingabeAngabe!F25),\"F\",EingabeAngabe!B25)","v":"F"}]
[{"$f":"EingabeAngabe!B26","v":"LE16"},{"$f":"IF(EingabeAngabe!C26=\"\",\"\",EingabeAngabe!C26)","v":""},null,{"$f":"IF(EingabeAngabe!D26=\"\",\"\",EingabeAngabe!D26)","v":""},{"$f":"IF(EingabeAngabe!E26=\"\",\"\",EingabeAngabe!E26)","v":""},{"$f":"IF(OR(G21=\"\",G21>EingabeAngabe!F26),\"F\",EingabeAngabe!B26)","v":"F"}]
[{"$f":"EingabeAngabe!B28","v":"MO19"},{"$f":"IF(EingabeAngabe!C28=\"\",\"\",EingabeAngabe!C28)","v":""},null,{"$f":"IF(EingabeAngabe!D28=\"\",\"\",EingabeAngabe!D28)","v":""},null,{"$f":"IF(OR(G22=\"\",G22>EingabeAngabe!F27),\"F\",EingabeAngabe!B28)","v":"F"}]
[{"$f":"EingabeAngabe!B29","v":"MO20"},{"$f":"IF(EingabeAngabe!C29=\"\",\"\",EingabeAngabe!C29)","v":""},null,{"$f":"IF(EingabeAngabe!D29=\"\",\"\",EingabeAngabe!D29)","v":""},null,{"$f":"IF(OR(G23=\"\",G23>EingabeAngabe!F28),\"F\",EingabeAngabe!B29)","v":"F"},null,{"$f":"IF(EingabeAngabe!F60>\"\",EingabeAngabe!E59,\"\")","v":"Eigener Notenkommentar:"}]
[{"$f":"EingabeAngabe!B30","v":"MO21"},{"$f":"IF(EingabeAngabe!C30=\"\",\"\",EingabeAngabe!C30)","v":""},null,{"$f":"IF(EingabeAngabe!D30=\"\",\"\",EingabeAngabe!D30)","v":""},null,{"$f":"IF(OR(G24=\"\",G24>EingabeAngabe!F29),\"F\",EingabeAngabe!B30)","v":"F"}]
[{"$f":"EingabeAngabe!B31","v":"MO22"},{"$f":"IF(EingabeAngabe!C31=\"\",\"\",EingabeAngabe!C31)","v":""},null,{"$f":"IF(EingabeAngabe!D31=\"\",\"\",EingabeAngabe!D31)","v":""},null,{"$f":"IF(OR(G25=\"\",G25>EingabeAngabe!F30),\"F\",EingabeAngabe!B31)","v":"F"}]
[{"$f":"EingabeAngabe!B33","v":"SY25"},{"$f":"IF(EingabeAngabe!C33=\"\",\"\",EingabeAngabe!C33)","v":""},null,{"$f":"IF(EingabeAngabe!D33=\"\",\"\",EingabeAngabe!D33)","v":""},null,{"$f":"IF(OR(G26=\"\",G26>EingabeAngabe!F31),\"F\",EingabeAngabe!B33)","v":"F"}]
[{"$f":"EingabeAngabe!B34","v":"SY26"},{"$f":"IF(EingabeAngabe!C34=\"\",\"\",EingabeAngabe!C34)","v":""},null,{"$f":"IF(EingabeAngabe!D34=\"\",\"\",EingabeAngabe!D34)","v":""},null,{"$f":"IF(OR(G27=\"\",G27>EingabeAngabe!F32),\"F\",EingabeAngabe!B34)","v":"F"}]
[{"$f":"EingabeAngabe!B35","v":"SY27"},{"$f":"IF(EingabeAngabe!C35=\"\",\"\",EingabeAngabe!C35)","v":""},null,{"$f":"IF(EingabeAngabe!D35=\"\",\"\",EingabeAngabe!D35)","v":""},null,{"$f":"IF(OR(G28=\"\",G28>EingabeAngabe!F33),\"F\",EingabeAngabe!B35)","v":"F"},null,"Summe Übersetzungstext",null,null,null,null,{"$f":"EingabeAngabe!AA39","v":""}]
[{"$f":"EingabeAngabe!B36","v":"SY28"},{"$f":"IF(EingabeAngabe!C36=\"\",\"\",EingabeAngabe!C36)","v":""},null,{"$f":"IF(EingabeAngabe!D36=\"\",\"\",EingabeAngabe!D36)","v":""},null,{"$f":"IF(OR(G29=\"\",G29>EingabeAngabe!F34),\"F\",EingabeAngabe!B36)","v":"F"},null,"Summe Arbeitsaufgaben und Interpretation",null,null,null,null,{"$f":"EingabeAngabe!AA40","v":""}]
[null,{"$f":"EingabeAngabe!C37","v":"SPRACHLICHE QUALITÄT IN DER ZIELSPRACHE"},null,null,null,{"$f":"IF(OR(G30=1,G30=3,G30=5,G30>5),\"F\",\"4/2/0\")","v":"4/2/0"},null,"Gesamtsumme",null,null,null,null,{"$f":"EingabeAngabe!AA2","v":""}]
[null,null,null,null,null,null,null,"NOTE",null,null,{"$f":"IF(EingabeAngabe!AA3=1,\"Sehr gut\",IF(EingabeAngabe!AA3=2,\"Gut\",IF(EingabeAngabe!AA3=3,\"Befriedigend\",IF(EingabeAngabe!AA3=4,\"Genügend\",IF(EingabeAngabe!AA3=5,\"Nicht genügend\",\"\")))))","v":""}]

{"sheet":"Schueler22Punkte","index":25,"n_rows":31,"n_cols":13,"rows_kept":31,"cut":false,"hidden":false,"merged":[[28,1,28,2],[29,1,29,3],[29,7,29,11],[29,12,29,13],[30,7,30,9],[30,10,30,13],[27,7,27,11],[27,12,27,13],[28,3,28,4],[28,7,28,11],[28,12,28,13],[22,7,22,10],[23,1,23,2],[23,3,23,4],[23,7,26,13],[24,1,24,2],[24,3,24,4],[25,3,25,4],[26,3,26,4],[22,1,22,2],[22,3,22,4],[25,1,25,2],[26,1,26,2],[27,1,27,2],[27,3,27,4],[15,0,16,0],[15,1,15,4],[15,5,16,5],[15,6,16,6],[16,1,16,4],[13,7,13,13],[14,7,21,13],[17,1,17,2],[18,1,18,2],[19,1,19,2],[20,1,20,2],[21,1,21,2],[21,3,21,4],[13,0,14,0],[13,1,13,4],[13,5,14,5],[13,6,14,6],[14,1,14,4],[10,11,10,13],[11,7,11,10],[11,11,11,13],[12,7,12,10],[12,11,12,13],[7,7,7,13],[8,7,8,10],[8,11,8,13],[11,0,12,0],[11,1,11,4],[11,5,12,5],[11,6,12,6],[12,1,12,4],[9,0,10,0],[9,1,9,4],[9,5,10,5],[9,6,10,6],[10,1,10,4],[9,7,9,10],[9,11,9,13],[10,7,10,10],[5,0,6,0],[5,1,5,4],[5,5,6,5],[5,6,6,6],[5,8,5,11],[6,1,6,4],[6,8,6,11],[7,0,8,0],[7,1,7,4],[7,5,8,5],[7,6,8,6],[8,1,8,4],[0,0,0,1],[0,3,0,4],[0,7,0,11],[1,0,2,0],[1,1,1,4],[1,5,2,5],[1,6,2,6],[1,8,1,11],[2,1,2,4],[2,8,2,11],[3,0,4,0],[3,1,3,4],[3,5,4,5],[3,6,4,6],[3,8,3,11],[4,1,4,4],[4,8,4,11]]}
["Übersetzungstext",null,"Schülername",{"$f":"SchuelernamenEingabe!B23","v":0},null,null,null,"Arbeitsaufgaben/ Interpretation"]
[{"$f":"EingabeAngabe!B6","v":"SE1"},{"$f":"IF(EingabeAngabe!C6=\"\",\"\",EingabeAngabe!C6)","v":""},null,null,null,{"$f":"IF(OR(G2=\"\",G2>EingabeAngabe!F6),\"F\",EingabeAngabe!B6)","v":"F"},null,{"$f":"EingabeAngabe!B41","v":"IT1"},{"$f":"IF(EingabeAngabe!C41=\"\",\"\",EingabeAngabe!C41)","v":""},null,null,null,{"$f":"IF(N2>EingabeAngabe!F41,\"F\",IF(EingabeAngabe!F41=\"\",\"\",EingabeAngabe!F41))","v":4}]
[null,{"$f":"IF(EingabeAngabe!C7=\"\",\"\",EingabeAngabe!C7)","v":""},null,null,null,null,null,{"$f":"EingabeAngabe!B42","v":"IT2"},{"$f":"IF(EingabeAngabe!C42=\"\",\"\",EingabeAngabe!C42)","v":""},null,null,null,{"$f":"IF(N3>EingabeAngabe!F42,\"F\",IF(EingabeAngabe!F42=\"\",\"\",EingabeAngabe!F42))","v":4}]
[{"$f":"EingabeAngabe!B8","v":"SE2"},{"$f":"IF(EingabeAngabe!C8=\"\",\"\",EingabeAngabe!C8)","v":""},null,null,null,{"$f":"IF(OR(G4=\"\",G4>EingabeAngabe!F8),\"F\",EingabeAngabe!B8)","v":"F"},null,{"$f":"EingabeAngabe!B43","v":"IT3"},{"$f":"IF(EingabeAngabe!C43=\"\",\"\",EingabeAngabe!C43)","v":""},null,null,null,{"$f":"IF(N4>EingabeAngabe!F43,\"F\",IF(EingabeAngabe!F43=\"\",\"\",EingabeAngabe!F43))","v":2}]
[null,{"$f":"IF(EingabeAngabe!C9=\"\",\"\",EingabeAngabe!C9)","v":""},null,null,null,null,null,{"$f":"EingabeAngabe!B44","v":"IT4"},{"$f":"IF(EingabeAngabe!C44=\"\",\"\",EingabeAngabe!C44)","v":""},null,null,null,{"$f":"IF(N5>EingabeAngabe!F44,\"F\",IF(EingabeAngabe!F44=\"\",\"\",EingabeAngabe!F44))","v":2}]
[{"$f":"EingabeAngabe!B10","v":"SE3"},{"$f":"IF(EingabeAngabe!C10=\"\",\"\",EingabeAngabe!C10)","v":""},null,null,null,{"$f":"IF(OR(G6=\"\",G6>EingabeAngabe!F10),\"F\",EingabeAngabe!B10)","v":"F"},null,{"$f":"EingabeAngabe!B45","v":"IT5"},{"$f":"IF(EingabeAngabe!C45=\"\",\"\",EingabeAngabe!C45)","v":""},null,null,null,{"$f":"IF(N6>EingabeAngabe!F45,\"F\",IF(EingabeAngabe!F45=\"\",\"\",EingabeAngabe!F45))","v":2}]
[null,{"$f":"IF(EingabeAngabe!C11=\"\",\"\",EingabeAngabe!C11)","v":""},null,null,null,null,null,{"$f":"EingabeAngabe!B46","v":"IT6"},{"$f":"IF(EingabeAngabe!C46=\"\",\"\",EingabeAngabe!C46)","v":""},null,null,null,{"$f":"IF(N7>EingabeAngabe!F46,\"F\",IF(EingabeAngabe!F46=\"\",\"\",EingabeAngabe!F46))","v":2}]
[{"$f":"EingabeAngabe!B12","v":"SE4"},{"$f":"IF(EingabeAngabe!C12=\"\",\"\",EingabeAngabe!C12)","v":""},null,null,null,{"$f":"IF(OR(G8=\"\",G8>EingabeAngabe!F12),\"F\",EingabeAngabe!B12)","v":"F"},null,"Notenschlüssel:"]
[null,{"$f":"IF(EingabeAngabe!C13=\"\",\"\",EingabeAngabe!C13)","v":""},null,null,null,null,null,"Sehr gut",null,null,null,{"$f":"EingabeAngabe!F50","v":"40 - 36"}]
[{"$f":"EingabeAngabe!B14","v":"SE5"},{"$f":"IF(EingabeAngabe!C14=\"\",\"\",EingabeAngabe!C14)","v":""},null,null,null,{"$f":"IF(OR(G10=\"\",G10>EingabeAngabe!F14),\"F\",EingabeAngabe!B14)","v":"F"},null,"Gut",null,null,null,{"$f":"EingabeAngabe!F51","v":"35 - 31"}]
[null,{"$f":"IF(EingabeAngabe!C15=\"\",\"\",EingabeAngabe!C15)","v":""},null,null,null,null,null,"Befriedigend",null,null,null,{"$f":"EingabeAngabe!F52","v":"30 - 26"}]
[{"$f":"EingabeAngabe!B16","v":"SE6"},{"$f":"IF(EingabeAngabe!C16=\"\",\"\",EingabeAngabe!C16)","v":""},null,null,null,{"$f":"IF(OR(G12=\"\",G12>EingabeAngabe!F16),\"F\",EingabeAngabe!B16)","v":"F"},null,"Genügend",null,null,null,{"$f":"EingabeAngabe!F53","v":"25 - 20"}]
[null,{"$f":"IF(EingabeAngabe!C17=\"\",\"\",EingabeAngabe!C17)","v":""},null,null,null,null,null,"Nicht genügend",null,null,null,{"$f":"EingabeAngabe!F54","v":"19 - 00"}]
[{"$f":"EingabeAngabe!B18","v":"SE7"},{"$f":"IF(EingabeAngabe!C18=\"\",\"\",EingabeAngabe!C18)","v":""},null,null,null,{"$f":"IF(OR(G14=\"\",G14>EingabeAngabe!F18),\"F\",EingabeAngabe!B18)","v":"F"},null,{"$f":"CONCATENATE(\"Notendefinition laut LBVO$14:\",\"            \",K31)","v":"Notendefinition laut LBVO$14:            "}]
[null,{"$f":"IF(EingabeAngabe!C19=\"\",\"\",EingabeAngabe!C19)","v":""},null,null,null,null,null,{"$f":"VLOOKUP(K31,SchuelernamenEingabe!D2:'SchuelernamenEingabe'!E40,2,FALSE)","v":{"$error":"#N/A"}}]
[{"$f":"EingabeAngabe!B20","v":"SE8"},{"$f":"IF(EingabeAngabe!C20=\"\",\"\",EingabeAngabe!C20)","v":""},null,null,null,{"$f":"IF(OR(G16=\"\",G16>EingabeAngabe!F20),\"F\",EingabeAngabe!B20)","v":"F"}]
[null,{"$f":"IF(EingabeAngabe!C21=\"\",\"\",EingabeAngabe!C21)","v":""}]
[{"$f":"EingabeAngabe!B23","v":"LE13"},{"$f":"IF(EingabeAngabe!C23=\"\",\"\",EingabeAngabe!C23)","v":""},null,{"$f":"IF(EingabeAngabe!D23=\"\",\"\",EingabeAngabe!D23)","v":""},{"$f":"IF(EingabeAngabe!E23=\"\",\"\",EingabeAngabe!E23)","v":""},{"$f":"IF(OR(G18=\"\",G18>EingabeAngabe!F23),\"F\",EingabeAngabe!B23)","v":"F"}]
[{"$f":"EingabeAngabe!B24","v":"LE14"},{"$f":"IF(EingabeAngabe!C24=\"\",\"\",EingabeAngabe!C24)","v":""},null,{"$f":"IF(EingabeAngabe!D24=\"\",\"\",EingabeAngabe!D24)","v":""},{"$f":"IF(EingabeAngabe!E24=\"\",\"\",EingabeAngabe!E24)","v":""},{"$f":"IF(OR(G19=\"\",G19>EingabeAngabe!F24),\"F\",EingabeAngabe!B24)","v":"F"}]
[{"$f":"EingabeAngabe!B25","v":"LE15"},{"$f":"IF(EingabeAngabe!C25=\"\",\"\",EingabeAngabe!C25)","v":""},null,{"$f":"IF(EingabeAngabe!D25=\"\",\"\",EingabeAngabe!D25)","v":""},{"$f":"IF(EingabeAngabe!E25=\"\",\"\",EingabeAngabe!E25)","v":""},{"$f":"IF(OR(G20=\"\",G20>EingabeAngabe!F25),\"F\",EingabeAngabe!B25)","v":"F"}]
[{"$f":"EingabeAngabe!B26","v":"LE16"},{"$f":"IF(EingabeAngabe!C26=\"\",\"\",EingabeAngabe!C26)","v":""},null,{"$f":"IF(EingabeAngabe!D26=\"\",\"\",EingabeAngabe!D26)","v":""},{"$f":"IF(EingabeAngabe!E26=\"\",\"\",EingabeAngabe!E26)","v":""},{"$f":"IF(OR(G21=\"\",G21>EingabeAngabe!F26),\"F\",EingabeAngabe!B26)","v":"F"}]
[{"$f":"EingabeAngabe!B28","v":"MO19"},{"$f":"IF(EingabeAngabe!C28=\"\",\"\",EingabeAngabe!C28)","v":""},null,{"$f":"IF(EingabeAngabe!D28=\"\",\"\",EingabeAngabe!D28)","v":""},null,{"$f":"IF(OR(G22=\"\",G22>EingabeAngabe!F27),\"F\",EingabeAngabe!B28)","v":"F"}]
[{"$f":"EingabeAngabe!B29","v":"MO20"},{"$f":"IF(EingabeAngabe!C29=\"\",\"\",EingabeAngabe!C29)","v":""},null,{"$f":"IF(EingabeAngabe!D29=\"\",\"\",EingabeAngabe!D29)","v":""},null,{"$f":"IF(OR(G23=\"\",G23>EingabeAngabe!F28),\"F\",EingabeAngabe!B29)","v":"F"},null,{"$f":"IF(EingabeAngabe!F60>\"\",EingabeAngabe!E59,\"\")","v":"Eigener Notenkommentar:"}]
[{"$f":"EingabeAngabe!B30","v":"MO21"},{"$f":"IF(EingabeAngabe!C30=\"\",\"\",EingabeAngabe!C30)","v":""},null,{"$f":"IF(EingabeAngabe!D30=\"\",\"\",EingabeAngabe!D30)","v":""},null,{"$f":"IF(OR(G24=\"\",G24>EingabeAngabe!F29),\"F\",EingabeAngabe!B30)","v":"F"}]
[{"$f":"EingabeAngabe!B31","v":"MO22"},{"$f":"IF(EingabeAngabe!C31=\"\",\"\",EingabeAngabe!C31)","v":""},null,{"$f":"IF(EingabeAngabe!D31=\"\",\"\",EingabeAngabe!D31)","v":""},null,{"$f":"IF(OR(G25=\"\",G25>EingabeAngabe!F30),\"F\",EingabeAngabe!B31)","v":"F"}]
[{"$f":"EingabeAngabe!B33","v":"SY25"},{"$f":"IF(EingabeAngabe!C33=\"\",\"\",EingabeAngabe!C33)","v":""},null,{"$f":"IF(EingabeAngabe!D33=\"\",\"\",EingabeAngabe!D33)","v":""},null,{"$f":"IF(OR(G26=\"\",G26>EingabeAngabe!F31),\"F\",EingabeAngabe!B33)","v":"F"}]
[{"$f":"EingabeAngabe!B34","v":"SY26"},{"$f":"IF(EingabeAngabe!C34=\"\",\"\",EingabeAngabe!C34)","v":""},null,{"$f":"IF(EingabeAngabe!D34=\"\",\"\",EingabeAngabe!D34)","v":""},null,{"$f":"IF(OR(G27=\"\",G27>EingabeAngabe!F32),\"F\",EingabeAngabe!B34)","v":"F"}]
[{"$f":"EingabeAngabe!B35","v":"SY27"},{"$f":"IF(EingabeAngabe!C35=\"\",\"\",EingabeAngabe!C35)","v":""},null,{"$f":"IF(EingabeAngabe!D35=\"\",\"\",EingabeAngabe!D35)","v":""},null,{"$f":"IF(OR(G28=\"\",G28>EingabeAngabe!F33),\"F\",EingabeAngabe!B35)","v":"F"},null,"Summe Übersetzungstext",null,null,null,null,{"$f":"EingabeAngabe!AB39","v":""}]
[{"$f":"EingabeAngabe!B36","v":"SY28"},{"$f":"IF(EingabeAngabe!C36=\"\",\"\",EingabeAngabe!C36)","v":""},null,{"$f":"IF(EingabeAngabe!D36=\"\",\"\",EingabeAngabe!D36)","v":""},null,{"$f":"IF(OR(G29=\"\",G29>EingabeAngabe!F34),\"F\",EingabeAngabe!B36)","v":"F"},null,"Summe Arbeitsaufgaben und Interpretation",null,null,null,null,{"$f":"EingabeAngabe!AB40","v":""}]
[null,{"$f":"EingabeAngabe!C37","v":"SPRACHLICHE QUALITÄT IN DER ZIELSPRACHE"},null,null,null,{"$f":"IF(OR(G30=1,G30=3,G30=5,G30>5),\"F\",\"4/2/0\")","v":"4/2/0"},null,"Gesamtsumme",null,null,null,null,{"$f":"EingabeAngabe!AB2","v":""}]
[null,null,null,null,null,null,null,"NOTE",null,null,{"$f":"IF(EingabeAngabe!AB3=1,\"Sehr gut\",IF(EingabeAngabe!AB3=2,\"Gut\",IF(EingabeAngabe!AB3=3,\"Befriedigend\",IF(EingabeAngabe!AB3=4,\"Genügend\",IF(EingabeAngabe!AB3=5,\"Nicht genügend\",\"\")))))","v":""}]

{"sheet":"Schueler23Punkte","index":26,"n_rows":31,"n_cols":13,"rows_kept":31,"cut":false,"hidden":false,"merged":[[28,1,28,2],[29,1,29,3],[29,7,29,11],[29,12,29,13],[30,7,30,9],[30,10,30,13],[27,7,27,11],[27,12,27,13],[28,3,28,4],[28,7,28,11],[28,12,28,13],[22,7,22,10],[23,1,23,2],[23,3,23,4],[23,7,26,13],[24,1,24,2],[24,3,24,4],[25,3,25,4],[26,3,26,4],[22,1,22,2],[22,3,22,4],[25,1,25,2],[26,1,26,2],[27,1,27,2],[27,3,27,4],[15,0,16,0],[15,1,15,4],[15,5,16,5],[15,6,16,6],[16,1,16,4],[13,7,13,13],[14,7,21,13],[17,1,17,2],[18,1,18,2],[19,1,19,2],[20,1,20,2],[21,1,21,2],[21,3,21,4],[13,0,14,0],[13,1,13,4],[13,5,14,5],[13,6,14,6],[14,1,14,4],[10,11,10,13],[11,7,11,10],[11,11,11,13],[12,7,12,10],[12,11,12,13],[7,7,7,13],[8,7,8,10],[8,11,8,13],[11,0,12,0],[11,1,11,4],[11,5,12,5],[11,6,12,6],[12,1,12,4],[9,0,10,0],[9,1,9,4],[9,5,10,5],[9,6,10,6],[10,1,10,4],[9,7,9,10],[9,11,9,13],[10,7,10,10],[5,0,6,0],[5,1,5,4],[5,5,6,5],[5,6,6,6],[5,8,5,11],[6,1,6,4],[6,8,6,11],[7,0,8,0],[7,1,7,4],[7,5,8,5],[7,6,8,6],[8,1,8,4],[0,0,0,1],[0,3,0,4],[0,7,0,11],[1,0,2,0],[1,1,1,4],[1,5,2,5],[1,6,2,6],[1,8,1,11],[2,1,2,4],[2,8,2,11],[3,0,4,0],[3,1,3,4],[3,5,4,5],[3,6,4,6],[3,8,3,11],[4,1,4,4],[4,8,4,11]]}
["Übersetzungstext",null,"Schülername",{"$f":"SchuelernamenEingabe!B24","v":0},null,null,null,"Arbeitsaufgaben/ Interpretation"]
[{"$f":"EingabeAngabe!B6","v":"SE1"},{"$f":"IF(EingabeAngabe!C6=\"\",\"\",EingabeAngabe!C6)","v":""},null,null,null,{"$f":"IF(OR(G2=\"\",G2>EingabeAngabe!F6),\"F\",EingabeAngabe!B6)","v":"F"},null,{"$f":"EingabeAngabe!B41","v":"IT1"},{"$f":"IF(EingabeAngabe!C41=\"\",\"\",EingabeAngabe!C41)","v":""},null,null,null,{"$f":"IF(N2>EingabeAngabe!F41,\"F\",IF(EingabeAngabe!F41=\"\",\"\",EingabeAngabe!F41))","v":4}]
[null,{"$f":"IF(EingabeAngabe!C7=\"\",\"\",EingabeAngabe!C7)","v":""},null,null,null,null,null,{"$f":"EingabeAngabe!B42","v":"IT2"},{"$f":"IF(EingabeAngabe!C42=\"\",\"\",EingabeAngabe!C42)","v":""},null,null,null,{"$f":"IF(N3>EingabeAngabe!F42,\"F\",IF(EingabeAngabe!F42=\"\",\"\",EingabeAngabe!F42))","v":4}]
[{"$f":"EingabeAngabe!B8","v":"SE2"},{"$f":"IF(EingabeAngabe!C8=\"\",\"\",EingabeAngabe!C8)","v":""},null,null,null,{"$f":"IF(OR(G4=\"\",G4>EingabeAngabe!F8),\"F\",EingabeAngabe!B8)","v":"F"},null,{"$f":"EingabeAngabe!B43","v":"IT3"},{"$f":"IF(EingabeAngabe!C43=\"\",\"\",EingabeAngabe!C43)","v":""},null,null,null,{"$f":"IF(N4>EingabeAngabe!F43,\"F\",IF(EingabeAngabe!F43=\"\",\"\",EingabeAngabe!F43))","v":2}]
[null,{"$f":"IF(EingabeAngabe!C9=\"\",\"\",EingabeAngabe!C9)","v":""},null,null,null,null,null,{"$f":"EingabeAngabe!B44","v":"IT4"},{"$f":"IF(EingabeAngabe!C44=\"\",\"\",EingabeAngabe!C44)","v":""},null,null,null,{"$f":"IF(N5>EingabeAngabe!F44,\"F\",IF(EingabeAngabe!F44=\"\",\"\",EingabeAngabe!F44))","v":2}]
[{"$f":"EingabeAngabe!B10","v":"SE3"},{"$f":"IF(EingabeAngabe!C10=\"\",\"\",EingabeAngabe!C10)","v":""},null,null,null,{"$f":"IF(OR(G6=\"\",G6>EingabeAngabe!F10),\"F\",EingabeAngabe!B10)","v":"F"},null,{"$f":"EingabeAngabe!B45","v":"IT5"},{"$f":"IF(EingabeAngabe!C45=\"\",\"\",EingabeAngabe!C45)","v":""},null,null,null,{"$f":"IF(N6>EingabeAngabe!F45,\"F\",IF(EingabeAngabe!F45=\"\",\"\",EingabeAngabe!F45))","v":2}]
[null,{"$f":"IF(EingabeAngabe!C11=\"\",\"\",EingabeAngabe!C11)","v":""},null,null,null,null,null,{"$f":"EingabeAngabe!B46","v":"IT6"},{"$f":"IF(EingabeAngabe!C46=\"\",\"\",EingabeAngabe!C46)","v":""},null,null,null,{"$f":"IF(N7>EingabeAngabe!F46,\"F\",IF(EingabeAngabe!F46=\"\",\"\",EingabeAngabe!F46))","v":2}]
[{"$f":"EingabeAngabe!B12","v":"SE4"},{"$f":"IF(EingabeAngabe!C12=\"\",\"\",EingabeAngabe!C12)","v":""},null,null,null,{"$f":"IF(OR(G8=\"\",G8>EingabeAngabe!F12),\"F\",EingabeAngabe!B12)","v":"F"},null,"Notenschlüssel:"]
[null,{"$f":"IF(EingabeAngabe!C13=\"\",\"\",EingabeAngabe!C13)","v":""},null,null,null,null,null,"Sehr gut",null,null,null,{"$f":"EingabeAngabe!F50","v":"40 - 36"}]
[{"$f":"EingabeAngabe!B14","v":"SE5"},{"$f":"IF(EingabeAngabe!C14=\"\",\"\",EingabeAngabe!C14)","v":""},null,null,null,{"$f":"IF(OR(G10=\"\",G10>EingabeAngabe!F14),\"F\",EingabeAngabe!B14)","v":"F"},null,"Gut",null,null,null,{"$f":"EingabeAngabe!F51","v":"35 - 31"}]
[null,{"$f":"IF(EingabeAngabe!C15=\"\",\"\",EingabeAngabe!C15)","v":""},null,null,null,null,null,"Befriedigend",null,null,null,{"$f":"EingabeAngabe!F52","v":"30 - 26"}]
[{"$f":"EingabeAngabe!B16","v":"SE6"},{"$f":"IF(EingabeAngabe!C16=\"\",\"\",EingabeAngabe!C16)","v":""},null,null,null,{"$f":"IF(OR(G12=\"\",G12>EingabeAngabe!F16),\"F\",EingabeAngabe!B16)","v":"F"},null,"Genügend",null,null,null,{"$f":"EingabeAngabe!F53","v":"25 - 20"}]
[null,{"$f":"IF(EingabeAngabe!C17=\"\",\"\",EingabeAngabe!C17)","v":""},null,null,null,null,null,"Nicht genügend",null,null,null,{"$f":"EingabeAngabe!F54","v":"19 - 00"}]
[{"$f":"EingabeAngabe!B18","v":"SE7"},{"$f":"IF(EingabeAngabe!C18=\"\",\"\",EingabeAngabe!C18)","v":""},null,null,null,{"$f":"IF(OR(G14=\"\",G14>EingabeAngabe!F18),\"F\",EingabeAngabe!B18)","v":"F"},null,{"$f":"CONCATENATE(\"Notendefinition laut LBVO$14:\",\"            \",K31)","v":"Notendefinition laut LBVO$14:            "}]
[null,{"$f":"IF(EingabeAngabe!C19=\"\",\"\",EingabeAngabe!C19)","v":""},null,null,null,null,null,{"$f":"VLOOKUP(K31,SchuelernamenEingabe!D2:'SchuelernamenEingabe'!E40,2,FALSE)","v":{"$error":"#N/A"}}]
[{"$f":"EingabeAngabe!B20","v":"SE8"},{"$f":"IF(EingabeAngabe!C20=\"\",\"\",EingabeAngabe!C20)","v":""},null,null,null,{"$f":"IF(OR(G16=\"\",G16>EingabeAngabe!F20),\"F\",EingabeAngabe!B20)","v":"F"}]
[null,{"$f":"IF(EingabeAngabe!C21=\"\",\"\",EingabeAngabe!C21)","v":""}]
[{"$f":"EingabeAngabe!B23","v":"LE13"},{"$f":"IF(EingabeAngabe!C23=\"\",\"\",EingabeAngabe!C23)","v":""},null,{"$f":"IF(EingabeAngabe!D23=\"\",\"\",EingabeAngabe!D23)","v":""},{"$f":"IF(EingabeAngabe!E23=\"\",\"\",EingabeAngabe!E23)","v":""},{"$f":"IF(OR(G18=\"\",G18>EingabeAngabe!F23),\"F\",EingabeAngabe!B23)","v":"F"}]
[{"$f":"EingabeAngabe!B24","v":"LE14"},{"$f":"IF(EingabeAngabe!C24=\"\",\"\",EingabeAngabe!C24)","v":""},null,{"$f":"IF(EingabeAngabe!D24=\"\",\"\",EingabeAngabe!D24)","v":""},{"$f":"IF(EingabeAngabe!E24=\"\",\"\",EingabeAngabe!E24)","v":""},{"$f":"IF(OR(G19=\"\",G19>EingabeAngabe!F24),\"F\",EingabeAngabe!B24)","v":"F"}]
[{"$f":"EingabeAngabe!B25","v":"LE15"},{"$f":"IF(EingabeAngabe!C25=\"\",\"\",EingabeAngabe!C25)","v":""},null,{"$f":"IF(EingabeAngabe!D25=\"\",\"\",EingabeAngabe!D25)","v":""},{"$f":"IF(EingabeAngabe!E25=\"\",\"\",EingabeAngabe!E25)","v":""},{"$f":"IF(OR(G20=\"\",G20>EingabeAngabe!F25),\"F\",EingabeAngabe!B25)","v":"F"}]
[{"$f":"EingabeAngabe!B26","v":"LE16"},{"$f":"IF(EingabeAngabe!C26=\"\",\"\",EingabeAngabe!C26)","v":""},null,{"$f":"IF(EingabeAngabe!D26=\"\",\"\",EingabeAngabe!D26)","v":""},{"$f":"IF(EingabeAngabe!E26=\"\",\"\",EingabeAngabe!E26)","v":""},{"$f":"IF(OR(G21=\"\",G21>EingabeAngabe!F26),\"F\",EingabeAngabe!B26)","v":"F"}]
[{"$f":"EingabeAngabe!B28","v":"MO19"},{"$f":"IF(EingabeAngabe!C28=\"\",\"\",EingabeAngabe!C28)","v":""},null,{"$f":"IF(EingabeAngabe!D28=\"\",\"\",EingabeAngabe!D28)","v":""},null,{"$f":"IF(OR(G22=\"\",G22>EingabeAngabe!F27),\"F\",EingabeAngabe!B28)","v":"F"}]
[{"$f":"EingabeAngabe!B29","v":"MO20"},{"$f":"IF(EingabeAngabe!C29=\"\",\"\",EingabeAngabe!C29)","v":""},null,{"$f":"IF(EingabeAngabe!D29=\"\",\"\",EingabeAngabe!D29)","v":""},null,{"$f":"IF(OR(G23=\"\",G23>EingabeAngabe!F28),\"F\",EingabeAngabe!B29)","v":"F"},null,{"$f":"IF(EingabeAngabe!F60>\"\",EingabeAngabe!E59,\"\")","v":"Eigener Notenkommentar:"}]
[{"$f":"EingabeAngabe!B30","v":"MO21"},{"$f":"IF(EingabeAngabe!C30=\"\",\"\",EingabeAngabe!C30)","v":""},null,{"$f":"IF(EingabeAngabe!D30=\"\",\"\",EingabeAngabe!D30)","v":""},null,{"$f":"IF(OR(G24=\"\",G24>EingabeAngabe!F29),\"F\",EingabeAngabe!B30)","v":"F"}]
[{"$f":"EingabeAngabe!B31","v":"MO22"},{"$f":"IF(EingabeAngabe!C31=\"\",\"\",EingabeAngabe!C31)","v":""},null,{"$f":"IF(EingabeAngabe!D31=\"\",\"\",EingabeAngabe!D31)","v":""},null,{"$f":"IF(OR(G25=\"\",G25>EingabeAngabe!F30),\"F\",EingabeAngabe!B31)","v":"F"}]
[{"$f":"EingabeAngabe!B33","v":"SY25"},{"$f":"IF(EingabeAngabe!C33=\"\",\"\",EingabeAngabe!C33)","v":""},null,{"$f":"IF(EingabeAngabe!D33=\"\",\"\",EingabeAngabe!D33)","v":""},null,{"$f":"IF(OR(G26=\"\",G26>EingabeAngabe!F31),\"F\",EingabeAngabe!B33)","v":"F"}]
[{"$f":"EingabeAngabe!B34","v":"SY26"},{"$f":"IF(EingabeAngabe!C34=\"\",\"\",EingabeAngabe!C34)","v":""},null,{"$f":"IF(EingabeAngabe!D34=\"\",\"\",EingabeAngabe!D34)","v":""},null,{"$f":"IF(OR(G27=\"\",G27>EingabeAngabe!F32),\"F\",EingabeAngabe!B34)","v":"F"}]
[{"$f":"EingabeAngabe!B35","v":"SY27"},{"$f":"IF(EingabeAngabe!C35=\"\",\"\",EingabeAngabe!C35)","v":""},null,{"$f":"IF(EingabeAngabe!D35=\"\",\"\",EingabeAngabe!D35)","v":""},null,{"$f":"IF(OR(G28=\"\",G28>EingabeAngabe!F33),\"F\",EingabeAngabe!B35)","v":"F"},null,"Summe Übersetzungstext",null,null,null,null,{"$f":"EingabeAngabe!AC39","v":""}]
[{"$f":"EingabeAngabe!B36","v":"SY28"},{"$f":"IF(EingabeAngabe!C36=\"\",\"\",EingabeAngabe!C36)","v":""},null,{"$f":"IF(EingabeAngabe!D36=\"\",\"\",EingabeAngabe!D36)","v":""},null,{"$f":"IF(OR(G29=\"\",G29>EingabeAngabe!F34),\"F\",EingabeAngabe!B36)","v":"F"},null,"Summe Arbeitsaufgaben und Interpretation",null,null,null,null,{"$f":"EingabeAngabe!AC40","v":""}]
[null,{"$f":"EingabeAngabe!C37","v":"SPRACHLICHE QUALITÄT IN DER ZIELSPRACHE"},null,null,null,{"$f":"IF(OR(G30=1,G30=3,G30=5,G30>5),\"F\",\"4/2/0\")","v":"4/2/0"},null,"Gesamtsumme",null,null,null,null,{"$f":"EingabeAngabe!AC2","v":""}]
[null,null,null,null,null,null,null,"NOTE",null,null,{"$f":"IF(EingabeAngabe!AC3=1,\"Sehr gut\",IF(EingabeAngabe!AC3=2,\"Gut\",IF(EingabeAngabe!AC3=3,\"Befriedigend\",IF(EingabeAngabe!AC3=4,\"Genügend\",IF(EingabeAngabe!AC3=5,\"Nicht genügend\",\"\")))))","v":""}]

{"sheet":"Schueler24Punkte","index":27,"n_rows":31,"n_cols":13,"rows_kept":31,"cut":false,"hidden":false,"merged":[[28,1,28,2],[29,1,29,3],[29,7,29,11],[29,12,29,13],[30,7,30,9],[30,10,30,13],[27,7,27,11],[27,12,27,13],[28,3,28,4],[28,7,28,11],[28,12,28,13],[22,7,22,10],[23,1,23,2],[23,3,23,4],[23,7,26,13],[24,1,24,2],[24,3,24,4],[25,3,25,4],[26,3,26,4],[22,1,22,2],[22,3,22,4],[25,1,25,2],[26,1,26,2],[27,1,27,2],[27,3,27,4],[15,0,16,0],[15,1,15,4],[15,5,16,5],[15,6,16,6],[16,1,16,4],[13,7,13,13],[14,7,21,13],[17,1,17,2],[18,1,18,2],[19,1,19,2],[20,1,20,2],[21,1,21,2],[21,3,21,4],[13,0,14,0],[13,1,13,4],[13,5,14,5],[13,6,14,6],[14,1,14,4],[10,11,10,13],[11,7,11,10],[11,11,11,13],[12,7,12,10],[12,11,12,13],[7,7,7,13],[8,7,8,10],[8,11,8,13],[11,0,12,0],[11,1,11,4],[11,5,12,5],[11,6,12,6],[12,1,12,4],[9,0,10,0],[9,1,9,4],[9,5,10,5],[9,6,10,6],[10,1,10,4],[9,7,9,10],[9,11,9,13],[10,7,10,10],[5,0,6,0],[5,1,5,4],[5,5,6,5],[5,6,6,6],[5,8,5,11],[6,1,6,4],[6,8,6,11],[7,0,8,0],[7,1,7,4],[7,5,8,5],[7,6,8,6],[8,1,8,4],[0,0,0,1],[0,3,0,4],[0,7,0,11],[1,0,2,0],[1,1,1,4],[1,5,2,5],[1,6,2,6],[1,8,1,11],[2,1,2,4],[2,8,2,11],[3,0,4,0],[3,1,3,4],[3,5,4,5],[3,6,4,6],[3,8,3,11],[4,1,4,4],[4,8,4,11]]}
["Übersetzungstext",null,"Schülername",{"$f":"SchuelernamenEingabe!B25","v":0},null,null,null,"Arbeitsaufgaben/ Interpretation"]
[{"$f":"EingabeAngabe!B6","v":"SE1"},{"$f":"IF(EingabeAngabe!C6=\"\",\"\",EingabeAngabe!C6)","v":""},null,null,null,{"$f":"IF(OR(G2=\"\",G2>EingabeAngabe!F6),\"F\",EingabeAngabe!B6)","v":"F"},null,{"$f":"EingabeAngabe!B41","v":"IT1"},{"$f":"IF(EingabeAngabe!C41=\"\",\"\",EingabeAngabe!C41)","v":""},null,null,null,{"$f":"IF(N2>EingabeAngabe!F41,\"F\",IF(EingabeAngabe!F41=\"\",\"\",EingabeAngabe!F41))","v":4}]
[null,{"$f":"IF(EingabeAngabe!C7=\"\",\"\",EingabeAngabe!C7)","v":""},null,null,null,null,null,{"$f":"EingabeAngabe!B42","v":"IT2"},{"$f":"IF(EingabeAngabe!C42=\"\",\"\",EingabeAngabe!C42)","v":""},null,null,null,{"$f":"IF(N3>EingabeAngabe!F42,\"F\",IF(EingabeAngabe!F42=\"\",\"\",EingabeAngabe!F42))","v":4}]
[{"$f":"EingabeAngabe!B8","v":"SE2"},{"$f":"IF(EingabeAngabe!C8=\"\",\"\",EingabeAngabe!C8)","v":""},null,null,null,{"$f":"IF(OR(G4=\"\",G4>EingabeAngabe!F8),\"F\",EingabeAngabe!B8)","v":"F"},null,{"$f":"EingabeAngabe!B43","v":"IT3"},{"$f":"IF(EingabeAngabe!C43=\"\",\"\",EingabeAngabe!C43)","v":""},null,null,null,{"$f":"IF(N4>EingabeAngabe!F43,\"F\",IF(EingabeAngabe!F43=\"\",\"\",EingabeAngabe!F43))","v":2}]
[null,{"$f":"IF(EingabeAngabe!C9=\"\",\"\",EingabeAngabe!C9)","v":""},null,null,null,null,null,{"$f":"EingabeAngabe!B44","v":"IT4"},{"$f":"IF(EingabeAngabe!C44=\"\",\"\",EingabeAngabe!C44)","v":""},null,null,null,{"$f":"IF(N5>EingabeAngabe!F44,\"F\",IF(EingabeAngabe!F44=\"\",\"\",EingabeAngabe!F44))","v":2}]
[{"$f":"EingabeAngabe!B10","v":"SE3"},{"$f":"IF(EingabeAngabe!C10=\"\",\"\",EingabeAngabe!C10)","v":""},null,null,null,{"$f":"IF(OR(G6=\"\",G6>EingabeAngabe!F10),\"F\",EingabeAngabe!B10)","v":"F"},null,{"$f":"EingabeAngabe!B45","v":"IT5"},{"$f":"IF(EingabeAngabe!C45=\"\",\"\",EingabeAngabe!C45)","v":""},null,null,null,{"$f":"IF(N6>EingabeAngabe!F45,\"F\",IF(EingabeAngabe!F45=\"\",\"\",EingabeAngabe!F45))","v":2}]
[null,{"$f":"IF(EingabeAngabe!C11=\"\",\"\",EingabeAngabe!C11)","v":""},null,null,null,null,null,{"$f":"EingabeAngabe!B46","v":"IT6"},{"$f":"IF(EingabeAngabe!C46=\"\",\"\",EingabeAngabe!C46)","v":""},null,null,null,{"$f":"IF(N7>EingabeAngabe!F46,\"F\",IF(EingabeAngabe!F46=\"\",\"\",EingabeAngabe!F46))","v":2}]
[{"$f":"EingabeAngabe!B12","v":"SE4"},{"$f":"IF(EingabeAngabe!C12=\"\",\"\",EingabeAngabe!C12)","v":""},null,null,null,{"$f":"IF(OR(G8=\"\",G8>EingabeAngabe!F12),\"F\",EingabeAngabe!B12)","v":"F"},null,"Notenschlüssel:"]
[null,{"$f":"IF(EingabeAngabe!C13=\"\",\"\",EingabeAngabe!C13)","v":""},null,null,null,null,null,"Sehr gut",null,null,null,{"$f":"EingabeAngabe!F50","v":"40 - 36"}]
[{"$f":"EingabeAngabe!B14","v":"SE5"},{"$f":"IF(EingabeAngabe!C14=\"\",\"\",EingabeAngabe!C14)","v":""},null,null,null,{"$f":"IF(OR(G10=\"\",G10>EingabeAngabe!F14),\"F\",EingabeAngabe!B14)","v":"F"},null,"Gut",null,null,null,{"$f":"EingabeAngabe!F51","v":"35 - 31"}]
[null,{"$f":"IF(EingabeAngabe!C15=\"\",\"\",EingabeAngabe!C15)","v":""},null,null,null,null,null,"Befriedigend",null,null,null,{"$f":"EingabeAngabe!F52","v":"30 - 26"}]
[{"$f":"EingabeAngabe!B16","v":"SE6"},{"$f":"IF(EingabeAngabe!C16=\"\",\"\",EingabeAngabe!C16)","v":""},null,null,null,{"$f":"IF(OR(G12=\"\",G12>EingabeAngabe!F16),\"F\",EingabeAngabe!B16)","v":"F"},null,"Genügend",null,null,null,{"$f":"EingabeAngabe!F53","v":"25 - 20"}]
[null,{"$f":"IF(EingabeAngabe!C17=\"\",\"\",EingabeAngabe!C17)","v":""},null,null,null,null,null,"Nicht genügend",null,null,null,{"$f":"EingabeAngabe!F54","v":"19 - 00"}]
[{"$f":"EingabeAngabe!B18","v":"SE7"},{"$f":"IF(EingabeAngabe!C18=\"\",\"\",EingabeAngabe!C18)","v":""},null,null,null,{"$f":"IF(OR(G14=\"\",G14>EingabeAngabe!F18),\"F\",EingabeAngabe!B18)","v":"F"},null,{"$f":"CONCATENATE(\"Notendefinition laut LBVO$14:\",\"            \",K31)","v":"Notendefinition laut LBVO$14:            "}]
[null,{"$f":"IF(EingabeAngabe!C19=\"\",\"\",EingabeAngabe!C19)","v":""},null,null,null,null,null,{"$f":"VLOOKUP(K31,SchuelernamenEingabe!D2:'SchuelernamenEingabe'!E40,2,FALSE)","v":{"$error":"#N/A"}}]
[{"$f":"EingabeAngabe!B20","v":"SE8"},{"$f":"IF(EingabeAngabe!C20=\"\",\"\",EingabeAngabe!C20)","v":""},null,null,null,{"$f":"IF(OR(G16=\"\",G16>EingabeAngabe!F20),\"F\",EingabeAngabe!B20)","v":"F"}]
[null,{"$f":"IF(EingabeAngabe!C21=\"\",\"\",EingabeAngabe!C21)","v":""}]
[{"$f":"EingabeAngabe!B23","v":"LE13"},{"$f":"IF(EingabeAngabe!C23=\"\",\"\",EingabeAngabe!C23)","v":""},null,{"$f":"IF(EingabeAngabe!D23=\"\",\"\",EingabeAngabe!D23)","v":""},{"$f":"IF(EingabeAngabe!E23=\"\",\"\",EingabeAngabe!E23)","v":""},{"$f":"IF(OR(G18=\"\",G18>EingabeAngabe!F23),\"F\",EingabeAngabe!B23)","v":"F"}]
[{"$f":"EingabeAngabe!B24","v":"LE14"},{"$f":"IF(EingabeAngabe!C24=\"\",\"\",EingabeAngabe!C24)","v":""},null,{"$f":"IF(EingabeAngabe!D24=\"\",\"\",EingabeAngabe!D24)","v":""},{"$f":"IF(EingabeAngabe!E24=\"\",\"\",EingabeAngabe!E24)","v":""},{"$f":"IF(OR(G19=\"\",G19>EingabeAngabe!F24),\"F\",EingabeAngabe!B24)","v":"F"}]
[{"$f":"EingabeAngabe!B25","v":"LE15"},{"$f":"IF(EingabeAngabe!C25=\"\",\"\",EingabeAngabe!C25)","v":""},null,{"$f":"IF(EingabeAngabe!D25=\"\",\"\",EingabeAngabe!D25)","v":""},{"$f":"IF(EingabeAngabe!E25=\"\",\"\",EingabeAngabe!E25)","v":""},{"$f":"IF(OR(G20=\"\",G20>EingabeAngabe!F25),\"F\",EingabeAngabe!B25)","v":"F"}]
[{"$f":"EingabeAngabe!B26","v":"LE16"},{"$f":"IF(EingabeAngabe!C26=\"\",\"\",EingabeAngabe!C26)","v":""},null,{"$f":"IF(EingabeAngabe!D26=\"\",\"\",EingabeAngabe!D26)","v":""},{"$f":"IF(EingabeAngabe!E26=\"\",\"\",EingabeAngabe!E26)","v":""},{"$f":"IF(OR(G21=\"\",G21>EingabeAngabe!F26),\"F\",EingabeAngabe!B26)","v":"F"}]
[{"$f":"EingabeAngabe!B28","v":"MO19"},{"$f":"IF(EingabeAngabe!C28=\"\",\"\",EingabeAngabe!C28)","v":""},null,{"$f":"IF(EingabeAngabe!D28=\"\",\"\",EingabeAngabe!D28)","v":""},null,{"$f":"IF(OR(G22=\"\",G22>EingabeAngabe!F27),\"F\",EingabeAngabe!B28)","v":"F"}]
[{"$f":"EingabeAngabe!B29","v":"MO20"},{"$f":"IF(EingabeAngabe!C29=\"\",\"\",EingabeAngabe!C29)","v":""},null,{"$f":"IF(EingabeAngabe!D29=\"\",\"\",EingabeAngabe!D29)","v":""},null,{"$f":"IF(OR(G23=\"\",G23>EingabeAngabe!F28),\"F\",EingabeAngabe!B29)","v":"F"},null,{"$f":"IF(EingabeAngabe!F60>\"\",EingabeAngabe!E59,\"\")","v":"Eigener Notenkommentar:"}]
[{"$f":"EingabeAngabe!B30","v":"MO21"},{"$f":"IF(EingabeAngabe!C30=\"\",\"\",EingabeAngabe!C30)","v":""},null,{"$f":"IF(EingabeAngabe!D30=\"\",\"\",EingabeAngabe!D30)","v":""},null,{"$f":"IF(OR(G24=\"\",G24>EingabeAngabe!F29),\"F\",EingabeAngabe!B30)","v":"F"}]
[{"$f":"EingabeAngabe!B31","v":"MO22"},{"$f":"IF(EingabeAngabe!C31=\"\",\"\",EingabeAngabe!C31)","v":""},null,{"$f":"IF(EingabeAngabe!D31=\"\",\"\",EingabeAngabe!D31)","v":""},null,{"$f":"IF(OR(G25=\"\",G25>EingabeAngabe!F30),\"F\",EingabeAngabe!B31)","v":"F"}]
[{"$f":"EingabeAngabe!B33","v":"SY25"},{"$f":"IF(EingabeAngabe!C33=\"\",\"\",EingabeAngabe!C33)","v":""},null,{"$f":"IF(EingabeAngabe!D33=\"\",\"\",EingabeAngabe!D33)","v":""},null,{"$f":"IF(OR(G26=\"\",G26>EingabeAngabe!F31),\"F\",EingabeAngabe!B33)","v":"F"}]
[{"$f":"EingabeAngabe!B34","v":"SY26"},{"$f":"IF(EingabeAngabe!C34=\"\",\"\",EingabeAngabe!C34)","v":""},null,{"$f":"IF(EingabeAngabe!D34=\"\",\"\",EingabeAngabe!D34)","v":""},null,{"$f":"IF(OR(G27=\"\",G27>EingabeAngabe!F32),\"F\",EingabeAngabe!B34)","v":"F"}]
[{"$f":"EingabeAngabe!B35","v":"SY27"},{"$f":"IF(EingabeAngabe!C35=\"\",\"\",EingabeAngabe!C35)","v":""},null,{"$f":"IF(EingabeAngabe!D35=\"\",\"\",EingabeAngabe!D35)","v":""},null,{"$f":"IF(OR(G28=\"\",G28>EingabeAngabe!F33),\"F\",EingabeAngabe!B35)","v":"F"},null,"Summe Übersetzungstext",null,null,null,null,{"$f":"EingabeAngabe!AD39","v":""}]
[{"$f":"EingabeAngabe!B36","v":"SY28"},{"$f":"IF(EingabeAngabe!C36=\"\",\"\",EingabeAngabe!C36)","v":""},null,{"$f":"IF(EingabeAngabe!D36=\"\",\"\",EingabeAngabe!D36)","v":""},null,{"$f":"IF(OR(G29=\"\",G29>EingabeAngabe!F34),\"F\",EingabeAngabe!B36)","v":"F"},null,"Summe Arbeitsaufgaben und Interpretation",null,null,null,null,{"$f":"EingabeAngabe!AD40","v":""}]
[null,{"$f":"EingabeAngabe!C37","v":"SPRACHLICHE QUALITÄT IN DER ZIELSPRACHE"},null,null,null,{"$f":"IF(OR(G30=1,G30=3,G30=5,G30>5),\"F\",\"4/2/0\")","v":"4/2/0"},null,"Gesamtsumme",null,null,null,null,{"$f":"EingabeAngabe!AD2","v":""}]
[null,null,null,null,null,null,null,"NOTE",null,null,{"$f":"IF(EingabeAngabe!AD3=1,\"Sehr gut\",IF(EingabeAngabe!AD3=2,\"Gut\",IF(EingabeAngabe!AD3=3,\"Befriedigend\",IF(EingabeAngabe!AD3=4,\"Genügend\",IF(EingabeAngabe!AD3=5,\"Nicht genügend\",\"\")))))","v":""}]

{"sheet":"Schueler25Punkte","index":28,"n_rows":31,"n_cols":13,"rows_kept":31,"cut":false,"hidden":false,"merged":[[28,1,28,2],[29,1,29,3],[29,7,29,11],[29,12,29,13],[30,7,30,9],[30,10,30,13],[27,7,27,11],[27,12,27,13],[28,3,28,4],[28,7,28,11],[28,12,28,13],[22,7,22,10],[23,1,23,2],[23,3,23,4],[23,7,26,13],[24,1,24,2],[24,3,24,4],[25,3,25,4],[26,3,26,4],[22,1,22,2],[22,3,22,4],[25,1,25,2],[26,1,26,2],[27,1,27,2],[27,3,27,4],[15,0,16,0],[15,1,15,4],[15,5,16,5],[15,6,16,6],[16,1,16,4],[13,7,13,13],[14,7,21,13],[17,1,17,2],[18,1,18,2],[19,1,19,2],[20,1,20,2],[21,1,21,2],[21,3,21,4],[13,0,14,0],[13,1,13,4],[13,5,14,5],[13,6,14,6],[14,1,14,4],[10,11,10,13],[11,7,11,10],[11,11,11,13],[12,7,12,10],[12,11,12,13],[7,7,7,13],[8,7,8,10],[8,11,8,13],[11,0,12,0],[11,1,11,4],[11,5,12,5],[11,6,12,6],[12,1,12,4],[9,0,10,0],[9,1,9,4],[9,5,10,5],[9,6,10,6],[10,1,10,4],[9,7,9,10],[9,11,9,13],[10,7,10,10],[5,0,6,0],[5,1,5,4],[5,5,6,5],[5,6,6,6],[5,8,5,11],[6,1,6,4],[6,8,6,11],[7,0,8,0],[7,1,7,4],[7,5,8,5],[7,6,8,6],[8,1,8,4],[0,0,0,1],[0,3,0,4],[0,7,0,11],[1,0,2,0],[1,1,1,4],[1,5,2,5],[1,6,2,6],[1,8,1,11],[2,1,2,4],[2,8,2,11],[3,0,4,0],[3,1,3,4],[3,5,4,5],[3,6,4,6],[3,8,3,11],[4,1,4,4],[4,8,4,11]]}
["Übersetzungstext",null,"Schülername",{"$f":"SchuelernamenEingabe!B26","v":0},null,null,null,"Arbeitsaufgaben/ Interpretation"]
[{"$f":"EingabeAngabe!B6","v":"SE1"},{"$f":"IF(EingabeAngabe!C6=\"\",\"\",EingabeAngabe!C6)","v":""},null,null,null,{"$f":"IF(OR(G2=\"\",G2>EingabeAngabe!F6),\"F\",EingabeAngabe!B6)","v":"F"},null,{"$f":"EingabeAngabe!B41","v":"IT1"},{"$f":"IF(EingabeAngabe!C41=\"\",\"\",EingabeAngabe!C41)","v":""},null,null,null,{"$f":"IF(N2>EingabeAngabe!F41,\"F\",IF(EingabeAngabe!F41=\"\",\"\",EingabeAngabe!F41))","v":4}]
[null,{"$f":"IF(EingabeAngabe!C7=\"\",\"\",EingabeAngabe!C7)","v":""},null,null,null,null,null,{"$f":"EingabeAngabe!B42","v":"IT2"},{"$f":"IF(EingabeAngabe!C42=\"\",\"\",EingabeAngabe!C42)","v":""},null,null,null,{"$f":"IF(N3>EingabeAngabe!F42,\"F\",IF(EingabeAngabe!F42=\"\",\"\",EingabeAngabe!F42))","v":4}]
[{"$f":"EingabeAngabe!B8","v":"SE2"},{"$f":"IF(EingabeAngabe!C8=\"\",\"\",EingabeAngabe!C8)","v":""},null,null,null,{"$f":"IF(OR(G4=\"\",G4>EingabeAngabe!F8),\"F\",EingabeAngabe!B8)","v":"F"},null,{"$f":"EingabeAngabe!B43","v":"IT3"},{"$f":"IF(EingabeAngabe!C43=\"\",\"\",EingabeAngabe!C43)","v":""},null,null,null,{"$f":"IF(N4>EingabeAngabe!F43,\"F\",IF(EingabeAngabe!F43=\"\",\"\",EingabeAngabe!F43))","v":2}]
[null,{"$f":"IF(EingabeAngabe!C9=\"\",\"\",EingabeAngabe!C9)","v":""},null,null,null,null,null,{"$f":"EingabeAngabe!B44","v":"IT4"},{"$f":"IF(EingabeAngabe!C44=\"\",\"\",EingabeAngabe!C44)","v":""},null,null,null,{"$f":"IF(N5>EingabeAngabe!F44,\"F\",IF(EingabeAngabe!F44=\"\",\"\",EingabeAngabe!F44))","v":2}]
[{"$f":"EingabeAngabe!B10","v":"SE3"},{"$f":"IF(EingabeAngabe!C10=\"\",\"\",EingabeAngabe!C10)","v":""},null,null,null,{"$f":"IF(OR(G6=\"\",G6>EingabeAngabe!F10),\"F\",EingabeAngabe!B10)","v":"F"},null,{"$f":"EingabeAngabe!B45","v":"IT5"},{"$f":"IF(EingabeAngabe!C45=\"\",\"\",EingabeAngabe!C45)","v":""},null,null,null,{"$f":"IF(N6>EingabeAngabe!F45,\"F\",IF(EingabeAngabe!F45=\"\",\"\",EingabeAngabe!F45))","v":2}]
[null,{"$f":"IF(EingabeAngabe!C11=\"\",\"\",EingabeAngabe!C11)","v":""},null,null,null,null,null,{"$f":"EingabeAngabe!B46","v":"IT6"},{"$f":"IF(EingabeAngabe!C46=\"\",\"\",EingabeAngabe!C46)","v":""},null,null,null,{"$f":"IF(N7>EingabeAngabe!F46,\"F\",IF(EingabeAngabe!F46=\"\",\"\",EingabeAngabe!F46))","v":2}]
[{"$f":"EingabeAngabe!B12","v":"SE4"},{"$f":"IF(EingabeAngabe!C12=\"\",\"\",EingabeAngabe!C12)","v":""},null,null,null,{"$f":"IF(OR(G8=\"\",G8>EingabeAngabe!F12),\"F\",EingabeAngabe!B12)","v":"F"},null,"Notenschlüssel:"]
[null,{"$f":"IF(EingabeAngabe!C13=\"\",\"\",EingabeAngabe!C13)","v":""},null,null,null,null,null,"Sehr gut",null,null,null,{"$f":"EingabeAngabe!F50","v":"40 - 36"}]
[{"$f":"EingabeAngabe!B14","v":"SE5"},{"$f":"IF(EingabeAngabe!C14=\"\",\"\",EingabeAngabe!C14)","v":""},null,null,null,{"$f":"IF(OR(G10=\"\",G10>EingabeAngabe!F14),\"F\",EingabeAngabe!B14)","v":"F"},null,"Gut",null,null,null,{"$f":"EingabeAngabe!F51","v":"35 - 31"}]
[null,{"$f":"IF(EingabeAngabe!C15=\"\",\"\",EingabeAngabe!C15)","v":""},null,null,null,null,null,"Befriedigend",null,null,null,{"$f":"EingabeAngabe!F52","v":"30 - 26"}]
[{"$f":"EingabeAngabe!B16","v":"SE6"},{"$f":"IF(EingabeAngabe!C16=\"\",\"\",EingabeAngabe!C16)","v":""},null,null,null,{"$f":"IF(OR(G12=\"\",G12>EingabeAngabe!F16),\"F\",EingabeAngabe!B16)","v":"F"},null,"Genügend",null,null,null,{"$f":"EingabeAngabe!F53","v":"25 - 20"}]
[null,{"$f":"IF(EingabeAngabe!C17=\"\",\"\",EingabeAngabe!C17)","v":""},null,null,null,null,null,"Nicht genügend",null,null,null,{"$f":"EingabeAngabe!F54","v":"19 - 00"}]
[{"$f":"EingabeAngabe!B18","v":"SE7"},{"$f":"IF(EingabeAngabe!C18=\"\",\"\",EingabeAngabe!C18)","v":""},null,null,null,{"$f":"IF(OR(G14=\"\",G14>EingabeAngabe!F18),\"F\",EingabeAngabe!B18)","v":"F"},null,{"$f":"CONCATENATE(\"Notendefinition laut LBVO$14:\",\"            \",K31)","v":"Notendefinition laut LBVO$14:            "}]
[null,{"$f":"IF(EingabeAngabe!C19=\"\",\"\",EingabeAngabe!C19)","v":""},null,null,null,null,null,{"$f":"VLOOKUP(K31,SchuelernamenEingabe!D2:'SchuelernamenEingabe'!E40,2,FALSE)","v":{"$error":"#N/A"}}]
[{"$f":"EingabeAngabe!B20","v":"SE8"},{"$f":"IF(EingabeAngabe!C20=\"\",\"\",EingabeAngabe!C20)","v":""},null,null,null,{"$f":"IF(OR(G16=\"\",G16>EingabeAngabe!F20),\"F\",EingabeAngabe!B20)","v":"F"}]
[null,{"$f":"IF(EingabeAngabe!C21=\"\",\"\",EingabeAngabe!C21)","v":""}]
[{"$f":"EingabeAngabe!B23","v":"LE13"},{"$f":"IF(EingabeAngabe!C23=\"\",\"\",EingabeAngabe!C23)","v":""},null,{"$f":"IF(EingabeAngabe!D23=\"\",\"\",EingabeAngabe!D23)","v":""},{"$f":"IF(EingabeAngabe!E23=\"\",\"\",EingabeAngabe!E23)","v":""},{"$f":"IF(OR(G18=\"\",G18>EingabeAngabe!F23),\"F\",EingabeAngabe!B23)","v":"F"}]
[{"$f":"EingabeAngabe!B24","v":"LE14"},{"$f":"IF(EingabeAngabe!C24=\"\",\"\",EingabeAngabe!C24)","v":""},null,{"$f":"IF(EingabeAngabe!D24=\"\",\"\",EingabeAngabe!D24)","v":""},{"$f":"IF(EingabeAngabe!E24=\"\",\"\",EingabeAngabe!E24)","v":""},{"$f":"IF(OR(G19=\"\",G19>EingabeAngabe!F24),\"F\",EingabeAngabe!B24)","v":"F"}]
[{"$f":"EingabeAngabe!B25","v":"LE15"},{"$f":"IF(EingabeAngabe!C25=\"\",\"\",EingabeAngabe!C25)","v":""},null,{"$f":"IF(EingabeAngabe!D25=\"\",\"\",EingabeAngabe!D25)","v":""},{"$f":"IF(EingabeAngabe!E25=\"\",\"\",EingabeAngabe!E25)","v":""},{"$f":"IF(OR(G20=\"\",G20>EingabeAngabe!F25),\"F\",EingabeAngabe!B25)","v":"F"}]
[{"$f":"EingabeAngabe!B26","v":"LE16"},{"$f":"IF(EingabeAngabe!C26=\"\",\"\",EingabeAngabe!C26)","v":""},null,{"$f":"IF(EingabeAngabe!D26=\"\",\"\",EingabeAngabe!D26)","v":""},{"$f":"IF(EingabeAngabe!E26=\"\",\"\",EingabeAngabe!E26)","v":""},{"$f":"IF(OR(G21=\"\",G21>EingabeAngabe!F26),\"F\",EingabeAngabe!B26)","v":"F"}]
[{"$f":"EingabeAngabe!B28","v":"MO19"},{"$f":"IF(EingabeAngabe!C28=\"\",\"\",EingabeAngabe!C28)","v":""},null,{"$f":"IF(EingabeAngabe!D28=\"\",\"\",EingabeAngabe!D28)","v":""},null,{"$f":"IF(OR(G22=\"\",G22>EingabeAngabe!F27),\"F\",EingabeAngabe!B28)","v":"F"}]
[{"$f":"EingabeAngabe!B29","v":"MO20"},{"$f":"IF(EingabeAngabe!C29=\"\",\"\",EingabeAngabe!C29)","v":""},null,{"$f":"IF(EingabeAngabe!D29=\"\",\"\",EingabeAngabe!D29)","v":""},null,{"$f":"IF(OR(G23=\"\",G23>EingabeAngabe!F28),\"F\",EingabeAngabe!B29)","v":"F"},null,{"$f":"IF(EingabeAngabe!F60>\"\",EingabeAngabe!E59,\"\")","v":"Eigener Notenkommentar:"}]
[{"$f":"EingabeAngabe!B30","v":"MO21"},{"$f":"IF(EingabeAngabe!C30=\"\",\"\",EingabeAngabe!C30)","v":""},null,{"$f":"IF(EingabeAngabe!D30=\"\",\"\",EingabeAngabe!D30)","v":""},null,{"$f":"IF(OR(G24=\"\",G24>EingabeAngabe!F29),\"F\",EingabeAngabe!B30)","v":"F"}]
[{"$f":"EingabeAngabe!B31","v":"MO22"},{"$f":"IF(EingabeAngabe!C31=\"\",\"\",EingabeAngabe!C31)","v":""},null,{"$f":"IF(EingabeAngabe!D31=\"\",\"\",EingabeAngabe!D31)","v":""},null,{"$f":"IF(OR(G25=\"\",G25>EingabeAngabe!F30),\"F\",EingabeAngabe!B31)","v":"F"}]
[{"$f":"EingabeAngabe!B33","v":"SY25"},{"$f":"IF(EingabeAngabe!C33=\"\",\"\",EingabeAngabe!C33)","v":""},null,{"$f":"IF(EingabeAngabe!D33=\"\",\"\",EingabeAngabe!D33)","v":""},null,{"$f":"IF(OR(G26=\"\",G26>EingabeAngabe!F31),\"F\",EingabeAngabe!B33)","v":"F"}]
[{"$f":"EingabeAngabe!B34","v":"SY26"},{"$f":"IF(EingabeAngabe!C34=\"\",\"\",EingabeAngabe!C34)","v":""},null,{"$f":"IF(EingabeAngabe!D34=\"\",\"\",EingabeAngabe!D34)","v":""},null,{"$f":"IF(OR(G27=\"\",G27>EingabeAngabe!F32),\"F\",EingabeAngabe!B34)","v":"F"}]
[{"$f":"EingabeAngabe!B35","v":"SY27"},{"$f":"IF(EingabeAngabe!C35=\"\",\"\",EingabeAngabe!C35)","v":""},null,{"$f":"IF(EingabeAngabe!D35=\"\",\"\",EingabeAngabe!D35)","v":""},null,{"$f":"IF(OR(G28=\"\",G28>EingabeAngabe!F33),\"F\",EingabeAngabe!B35)","v":"F"},null,"Summe Übersetzungstext",null,null,null,null,{"$f":"EingabeAngabe!AE39","v":""}]
[{"$f":"EingabeAngabe!B36","v":"SY28"},{"$f":"IF(EingabeAngabe!C36=\"\",\"\",EingabeAngabe!C36)","v":""},null,{"$f":"IF(EingabeAngabe!D36=\"\",\"\",EingabeAngabe!D36)","v":""},null,{"$f":"IF(OR(G29=\"\",G29>EingabeAngabe!F34),\"F\",EingabeAngabe!B36)","v":"F"},null,"Summe Arbeitsaufgaben und Interpretation",null,null,null,null,{"$f":"EingabeAngabe!AE40","v":""}]
[null,{"$f":"EingabeAngabe!C37","v":"SPRACHLICHE QUALITÄT IN DER ZIELSPRACHE"},null,null,null,{"$f":"IF(OR(G30=1,G30=3,G30=5,G30>5),\"F\",\"4/2/0\")","v":"4/2/0"},null,"Gesamtsumme",null,null,null,null,{"$f":"EingabeAngabe!AE2","v":""}]
[null,null,null,null,null,null,null,"NOTE",null,null,{"$f":"IF(EingabeAngabe!AE3=1,\"Sehr gut\",IF(EingabeAngabe!AE3=2,\"Gut\",IF(EingabeAngabe!AE3=3,\"Befriedigend\",IF(EingabeAngabe!AE3=4,\"Genügend\",IF(EingabeAngabe!AE3=5,\"Nicht genügend\",\"\")))))","v":""}]

{"sheet":"Schueler26Punkte","index":29,"n_rows":31,"n_cols":13,"rows_kept":31,"cut":false,"hidden":false,"merged":[[28,1,28,2],[29,1,29,3],[29,7,29,11],[29,12,29,13],[30,7,30,9],[30,10,30,13],[27,7,27,11],[27,12,27,13],[28,3,28,4],[28,7,28,11],[28,12,28,13],[22,7,22,10],[23,1,23,2],[23,3,23,4],[23,7,26,13],[24,1,24,2],[24,3,24,4],[25,3,25,4],[26,3,26,4],[22,1,22,2],[22,3,22,4],[25,1,25,2],[26,1,26,2],[27,1,27,2],[27,3,27,4],[15,0,16,0],[15,1,15,4],[15,5,16,5],[15,6,16,6],[16,1,16,4],[13,7,13,13],[14,7,21,13],[17,1,17,2],[18,1,18,2],[19,1,19,2],[20,1,20,2],[21,1,21,2],[21,3,21,4],[13,0,14,0],[13,1,13,4],[13,5,14,5],[13,6,14,6],[14,1,14,4],[10,11,10,13],[11,7,11,10],[11,11,11,13],[12,7,12,10],[12,11,12,13],[7,7,7,13],[8,7,8,10],[8,11,8,13],[11,0,12,0],[11,1,11,4],[11,5,12,5],[11,6,12,6],[12,1,12,4],[9,0,10,0],[9,1,9,4],[9,5,10,5],[9,6,10,6],[10,1,10,4],[9,7,9,10],[9,11,9,13],[10,7,10,10],[5,0,6,0],[5,1,5,4],[5,5,6,5],[5,6,6,6],[5,8,5,11],[6,1,6,4],[6,8,6,11],[7,0,8,0],[7,1,7,4],[7,5,8,5],[7,6,8,6],[8,1,8,4],[0,0,0,1],[0,3,0,4],[0,7,0,11],[1,0,2,0],[1,1,1,4],[1,5,2,5],[1,6,2,6],[1,8,1,11],[2,1,2,4],[2,8,2,11],[3,0,4,0],[3,1,3,4],[3,5,4,5],[3,6,4,6],[3,8,3,11],[4,1,4,4],[4,8,4,11]]}
["Übersetzungstext",null,"Schülername",{"$f":"SchuelernamenEingabe!B27","v":0},null,null,null,"Arbeitsaufgaben/ Interpretation"]
[{"$f":"EingabeAngabe!B6","v":"SE1"},{"$f":"IF(EingabeAngabe!C6=\"\",\"\",EingabeAngabe!C6)","v":""},null,null,null,{"$f":"IF(OR(G2=\"\",G2>EingabeAngabe!F6),\"F\",EingabeAngabe!B6)","v":"F"},null,{"$f":"EingabeAngabe!B41","v":"IT1"},{"$f":"IF(EingabeAngabe!C41=\"\",\"\",EingabeAngabe!C41)","v":""},null,null,null,{"$f":"IF(N2>EingabeAngabe!F41,\"F\",IF(EingabeAngabe!F41=\"\",\"\",EingabeAngabe!F41))","v":4}]
[null,{"$f":"IF(EingabeAngabe!C7=\"\",\"\",EingabeAngabe!C7)","v":""},null,null,null,null,null,{"$f":"EingabeAngabe!B42","v":"IT2"},{"$f":"IF(EingabeAngabe!C42=\"\",\"\",EingabeAngabe!C42)","v":""},null,null,null,{"$f":"IF(N3>EingabeAngabe!F42,\"F\",IF(EingabeAngabe!F42=\"\",\"\",EingabeAngabe!F42))","v":4}]
[{"$f":"EingabeAngabe!B8","v":"SE2"},{"$f":"IF(EingabeAngabe!C8=\"\",\"\",EingabeAngabe!C8)","v":""},null,null,null,{"$f":"IF(OR(G4=\"\",G4>EingabeAngabe!F8),\"F\",EingabeAngabe!B8)","v":"F"},null,{"$f":"EingabeAngabe!B43","v":"IT3"},{"$f":"IF(EingabeAngabe!C43=\"\",\"\",EingabeAngabe!C43)","v":""},null,null,null,{"$f":"IF(N4>EingabeAngabe!F43,\"F\",IF(EingabeAngabe!F43=\"\",\"\",EingabeAngabe!F43))","v":2}]
[null,{"$f":"IF(EingabeAngabe!C9=\"\",\"\",EingabeAngabe!C9)","v":""},null,null,null,null,null,{"$f":"EingabeAngabe!B44","v":"IT4"},{"$f":"IF(EingabeAngabe!C44=\"\",\"\",EingabeAngabe!C44)","v":""},null,null,null,{"$f":"IF(N5>EingabeAngabe!F44,\"F\",IF(EingabeAngabe!F44=\"\",\"\",EingabeAngabe!F44))","v":2}]
[{"$f":"EingabeAngabe!B10","v":"SE3"},{"$f":"IF(EingabeAngabe!C10=\"\",\"\",EingabeAngabe!C10)","v":""},null,null,null,{"$f":"IF(OR(G6=\"\",G6>EingabeAngabe!F10),\"F\",EingabeAngabe!B10)","v":"F"},null,{"$f":"EingabeAngabe!B45","v":"IT5"},{"$f":"IF(EingabeAngabe!C45=\"\",\"\",EingabeAngabe!C45)","v":""},null,null,null,{"$f":"IF(N6>EingabeAngabe!F45,\"F\",IF(EingabeAngabe!F45=\"\",\"\",EingabeAngabe!F45))","v":2}]
[null,{"$f":"IF(EingabeAngabe!C11=\"\",\"\",EingabeAngabe!C11)","v":""},null,null,null,null,null,{"$f":"EingabeAngabe!B46","v":"IT6"},{"$f":"IF(EingabeAngabe!C46=\"\",\"\",EingabeAngabe!C46)","v":""},null,null,null,{"$f":"IF(N7>EingabeAngabe!F46,\"F\",IF(EingabeAngabe!F46=\"\",\"\",EingabeAngabe!F46))","v":2}]
[{"$f":"EingabeAngabe!B12","v":"SE4"},{"$f":"IF(EingabeAngabe!C12=\"\",\"\",EingabeAngabe!C12)","v":""},null,null,null,{"$f":"IF(OR(G8=\"\",G8>EingabeAngabe!F12),\"F\",EingabeAngabe!B12)","v":"F"},null,"Notenschlüssel:"]
[null,{"$f":"IF(EingabeAngabe!C13=\"\",\"\",EingabeAngabe!C13)","v":""},null,null,null,null,null,"Sehr gut",null,null,null,{"$f":"EingabeAngabe!F50","v":"40 - 36"}]
[{"$f":"EingabeAngabe!B14","v":"SE5"},{"$f":"IF(EingabeAngabe!C14=\"\",\"\",EingabeAngabe!C14)","v":""},null,null,null,{"$f":"IF(OR(G10=\"\",G10>EingabeAngabe!F14),\"F\",EingabeAngabe!B14)","v":"F"},null,"Gut",null,null,null,{"$f":"EingabeAngabe!F51","v":"35 - 31"}]
[null,{"$f":"IF(EingabeAngabe!C15=\"\",\"\",EingabeAngabe!C15)","v":""},null,null,null,null,null,"Befriedigend",null,null,null,{"$f":"EingabeAngabe!F52","v":"30 - 26"}]
[{"$f":"EingabeAngabe!B16","v":"SE6"},{"$f":"IF(EingabeAngabe!C16=\"\",\"\",EingabeAngabe!C16)","v":""},null,null,null,{"$f":"IF(OR(G12=\"\",G12>EingabeAngabe!F16),\"F\",EingabeAngabe!B16)","v":"F"},null,"Genügend",null,null,null,{"$f":"EingabeAngabe!F53","v":"25 - 20"}]
[null,{"$f":"IF(EingabeAngabe!C17=\"\",\"\",EingabeAngabe!C17)","v":""},null,null,null,null,null,"Nicht genügend",null,null,null,{"$f":"EingabeAngabe!F54","v":"19 - 00"}]
[{"$f":"EingabeAngabe!B18","v":"SE7"},{"$f":"IF(EingabeAngabe!C18=\"\",\"\",EingabeAngabe!C18)","v":""},null,null,null,{"$f":"IF(OR(G14=\"\",G14>EingabeAngabe!F18),\"F\",EingabeAngabe!B18)","v":"F"},null,{"$f":"CONCATENATE(\"Notendefinition laut LBVO$14:\",\"            \",K31)","v":"Notendefinition laut LBVO$14:            "}]
[null,{"$f":"IF(EingabeAngabe!C19=\"\",\"\",EingabeAngabe!C19)","v":""},null,null,null,null,null,{"$f":"VLOOKUP(K31,SchuelernamenEingabe!D2:'SchuelernamenEingabe'!E40,2,FALSE)","v":{"$error":"#N/A"}}]
[{"$f":"EingabeAngabe!B20","v":"SE8"},{"$f":"IF(EingabeAngabe!C20=\"\",\"\",EingabeAngabe!C20)","v":""},null,null,null,{"$f":"IF(OR(G16=\"\",G16>EingabeAngabe!F20),\"F\",EingabeAngabe!B20)","v":"F"}]
[null,{"$f":"IF(EingabeAngabe!C21=\"\",\"\",EingabeAngabe!C21)","v":""}]
[{"$f":"EingabeAngabe!B23","v":"LE13"},{"$f":"IF(EingabeAngabe!C23=\"\",\"\",EingabeAngabe!C23)","v":""},null,{"$f":"IF(EingabeAngabe!D23=\"\",\"\",EingabeAngabe!D23)","v":""},{"$f":"IF(EingabeAngabe!E23=\"\",\"\",EingabeAngabe!E23)","v":""},{"$f":"IF(OR(G18=\"\",G18>EingabeAngabe!F23),\"F\",EingabeAngabe!B23)","v":"F"}]
[{"$f":"EingabeAngabe!B24","v":"LE14"},{"$f":"IF(EingabeAngabe!C24=\"\",\"\",EingabeAngabe!C24)","v":""},null,{"$f":"IF(EingabeAngabe!D24=\"\",\"\",EingabeAngabe!D24)","v":""},{"$f":"IF(EingabeAngabe!E24=\"\",\"\",EingabeAngabe!E24)","v":""},{"$f":"IF(OR(G19=\"\",G19>EingabeAngabe!F24),\"F\",EingabeAngabe!B24)","v":"F"}]
[{"$f":"EingabeAngabe!B25","v":"LE15"},{"$f":"IF(EingabeAngabe!C25=\"\",\"\",EingabeAngabe!C25)","v":""},null,{"$f":"IF(EingabeAngabe!D25=\"\",\"\",EingabeAngabe!D25)","v":""},{"$f":"IF(EingabeAngabe!E25=\"\",\"\",EingabeAngabe!E25)","v":""},{"$f":"IF(OR(G20=\"\",G20>EingabeAngabe!F25),\"F\",EingabeAngabe!B25)","v":"F"}]
[{"$f":"EingabeAngabe!B26","v":"LE16"},{"$f":"IF(EingabeAngabe!C26=\"\",\"\",EingabeAngabe!C26)","v":""},null,{"$f":"IF(EingabeAngabe!D26=\"\",\"\",EingabeAngabe!D26)","v":""},{"$f":"IF(EingabeAngabe!E26=\"\",\"\",EingabeAngabe!E26)","v":""},{"$f":"IF(OR(G21=\"\",G21>EingabeAngabe!F26),\"F\",EingabeAngabe!B26)","v":"F"}]
[{"$f":"EingabeAngabe!B28","v":"MO19"},{"$f":"IF(EingabeAngabe!C28=\"\",\"\",EingabeAngabe!C28)","v":""},null,{"$f":"IF(EingabeAngabe!D28=\"\",\"\",EingabeAngabe!D28)","v":""},null,{"$f":"IF(OR(G22=\"\",G22>EingabeAngabe!F27),\"F\",EingabeAngabe!B28)","v":"F"}]
[{"$f":"EingabeAngabe!B29","v":"MO20"},{"$f":"IF(EingabeAngabe!C29=\"\",\"\",EingabeAngabe!C29)","v":""},null,{"$f":"IF(EingabeAngabe!D29=\"\",\"\",EingabeAngabe!D29)","v":""},null,{"$f":"IF(OR(G23=\"\",G23>EingabeAngabe!F28),\"F\",EingabeAngabe!B29)","v":"F"},null,{"$f":"IF(EingabeAngabe!F60>\"\",EingabeAngabe!E59,\"\")","v":"Eigener Notenkommentar:"}]
[{"$f":"EingabeAngabe!B30","v":"MO21"},{"$f":"IF(EingabeAngabe!C30=\"\",\"\",EingabeAngabe!C30)","v":""},null,{"$f":"IF(EingabeAngabe!D30=\"\",\"\",EingabeAngabe!D30)","v":""},null,{"$f":"IF(OR(G24=\"\",G24>EingabeAngabe!F29),\"F\",EingabeAngabe!B30)","v":"F"}]
[{"$f":"EingabeAngabe!B31","v":"MO22"},{"$f":"IF(EingabeAngabe!C31=\"\",\"\",EingabeAngabe!C31)","v":""},null,{"$f":"IF(EingabeAngabe!D31=\"\",\"\",EingabeAngabe!D31)","v":""},null,{"$f":"IF(OR(G25=\"\",G25>EingabeAngabe!F30),\"F\",EingabeAngabe!B31)","v":"F"}]
[{"$f":"EingabeAngabe!B33","v":"SY25"},{"$f":"IF(EingabeAngabe!C33=\"\",\"\",EingabeAngabe!C33)","v":""},null,{"$f":"IF(EingabeAngabe!D33=\"\",\"\",EingabeAngabe!D33)","v":""},null,{"$f":"IF(OR(G26=\"\",G26>EingabeAngabe!F31),\"F\",EingabeAngabe!B33)","v":"F"}]
[{"$f":"EingabeAngabe!B34","v":"SY26"},{"$f":"IF(EingabeAngabe!C34=\"\",\"\",EingabeAngabe!C34)","v":""},null,{"$f":"IF(EingabeAngabe!D34=\"\",\"\",EingabeAngabe!D34)","v":""},null,{"$f":"IF(OR(G27=\"\",G27>EingabeAngabe!F32),\"F\",EingabeAngabe!B34)","v":"F"}]
[{"$f":"EingabeAngabe!B35","v":"SY27"},{"$f":"IF(EingabeAngabe!C35=\"\",\"\",EingabeAngabe!C35)","v":""},null,{"$f":"IF(EingabeAngabe!D35=\"\",\"\",EingabeAngabe!D35)","v":""},null,{"$f":"IF(OR(G28=\"\",G28>EingabeAngabe!F33),\"F\",EingabeAngabe!B35)","v":"F"},null,"Summe Übersetzungstext",null,null,null,null,{"$f":"EingabeAngabe!AF39","v":""}]
[{"$f":"EingabeAngabe!B36","v":"SY28"},{"$f":"IF(EingabeAngabe!C36=\"\",\"\",EingabeAngabe!C36)","v":""},null,{"$f":"IF(EingabeAngabe!D36=\"\",\"\",EingabeAngabe!D36)","v":""},null,{"$f":"IF(OR(G29=\"\",G29>EingabeAngabe!F34),\"F\",EingabeAngabe!B36)","v":"F"},null,"Summe Arbeitsaufgaben und Interpretation",null,null,null,null,{"$f":"EingabeAngabe!AF40","v":""}]
[null,{"$f":"EingabeAngabe!C37","v":"SPRACHLICHE QUALITÄT IN DER ZIELSPRACHE"},null,null,null,{"$f":"IF(OR(G30=1,G30=3,G30=5,G30>5),\"F\",\"4/2/0\")","v":"4/2/0"},null,"Gesamtsumme",null,null,null,null,{"$f":"EingabeAngabe!AF2","v":""}]
[null,null,null,null,null,null,null,"NOTE",null,null,{"$f":"IF(EingabeAngabe!AF3=1,\"Sehr gut\",IF(EingabeAngabe!AF3=2,\"Gut\",IF(EingabeAngabe!AF3=3,\"Befriedigend\",IF(EingabeAngabe!AF3=4,\"Genügend\",IF(EingabeAngabe!AF3=5,\"Nicht genügend\",\"\")))))","v":""}]

{"sheet":"Schueler27Punkte","index":30,"n_rows":31,"n_cols":13,"rows_kept":31,"cut":false,"hidden":false,"merged":[[28,1,28,2],[29,1,29,3],[29,7,29,11],[29,12,29,13],[30,7,30,9],[30,10,30,13],[27,7,27,11],[27,12,27,13],[28,3,28,4],[28,7,28,11],[28,12,28,13],[22,7,22,10],[23,1,23,2],[23,3,23,4],[23,7,26,13],[24,1,24,2],[24,3,24,4],[25,3,25,4],[26,3,26,4],[22,1,22,2],[22,3,22,4],[25,1,25,2],[26,1,26,2],[27,1,27,2],[27,3,27,4],[15,0,16,0],[15,1,15,4],[15,5,16,5],[15,6,16,6],[16,1,16,4],[13,7,13,13],[14,7,21,13],[17,1,17,2],[18,1,18,2],[19,1,19,2],[20,1,20,2],[21,1,21,2],[21,3,21,4],[13,0,14,0],[13,1,13,4],[13,5,14,5],[13,6,14,6],[14,1,14,4],[10,11,10,13],[11,7,11,10],[11,11,11,13],[12,7,12,10],[12,11,12,13],[7,7,7,13],[8,7,8,10],[8,11,8,13],[11,0,12,0],[11,1,11,4],[11,5,12,5],[11,6,12,6],[12,1,12,4],[9,0,10,0],[9,1,9,4],[9,5,10,5],[9,6,10,6],[10,1,10,4],[9,7,9,10],[9,11,9,13],[10,7,10,10],[5,0,6,0],[5,1,5,4],[5,5,6,5],[5,6,6,6],[5,8,5,11],[6,1,6,4],[6,8,6,11],[7,0,8,0],[7,1,7,4],[7,5,8,5],[7,6,8,6],[8,1,8,4],[0,0,0,1],[0,3,0,4],[0,7,0,11],[1,0,2,0],[1,1,1,4],[1,5,2,5],[1,6,2,6],[1,8,1,11],[2,1,2,4],[2,8,2,11],[3,0,4,0],[3,1,3,4],[3,5,4,5],[3,6,4,6],[3,8,3,11],[4,1,4,4],[4,8,4,11]]}
["Übersetzungstext",null,"Schülername",{"$f":"SchuelernamenEingabe!B28","v":0},null,null,null,"Arbeitsaufgaben/ Interpretation"]
[{"$f":"EingabeAngabe!B6","v":"SE1"},{"$f":"IF(EingabeAngabe!C6=\"\",\"\",EingabeAngabe!C6)","v":""},null,null,null,{"$f":"IF(OR(G2=\"\",G2>EingabeAngabe!F6),\"F\",EingabeAngabe!B6)","v":"F"},null,{"$f":"EingabeAngabe!B41","v":"IT1"},{"$f":"IF(EingabeAngabe!C41=\"\",\"\",EingabeAngabe!C41)","v":""},null,null,null,{"$f":"IF(N2>EingabeAngabe!F41,\"F\",IF(EingabeAngabe!F41=\"\",\"\",EingabeAngabe!F41))","v":4}]
[null,{"$f":"IF(EingabeAngabe!C7=\"\",\"\",EingabeAngabe!C7)","v":""},null,null,null,null,null,{"$f":"EingabeAngabe!B42","v":"IT2"},{"$f":"IF(EingabeAngabe!C42=\"\",\"\",EingabeAngabe!C42)","v":""},null,null,null,{"$f":"IF(N3>EingabeAngabe!F42,\"F\",IF(EingabeAngabe!F42=\"\",\"\",EingabeAngabe!F42))","v":4}]
[{"$f":"EingabeAngabe!B8","v":"SE2"},{"$f":"IF(EingabeAngabe!C8=\"\",\"\",EingabeAngabe!C8)","v":""},null,null,null,{"$f":"IF(OR(G4=\"\",G4>EingabeAngabe!F8),\"F\",EingabeAngabe!B8)","v":"F"},null,{"$f":"EingabeAngabe!B43","v":"IT3"},{"$f":"IF(EingabeAngabe!C43=\"\",\"\",EingabeAngabe!C43)","v":""},null,null,null,{"$f":"IF(N4>EingabeAngabe!F43,\"F\",IF(EingabeAngabe!F43=\"\",\"\",EingabeAngabe!F43))","v":2}]
[null,{"$f":"IF(EingabeAngabe!C9=\"\",\"\",EingabeAngabe!C9)","v":""},null,null,null,null,null,{"$f":"EingabeAngabe!B44","v":"IT4"},{"$f":"IF(EingabeAngabe!C44=\"\",\"\",EingabeAngabe!C44)","v":""},null,null,null,{"$f":"IF(N5>EingabeAngabe!F44,\"F\",IF(EingabeAngabe!F44=\"\",\"\",EingabeAngabe!F44))","v":2}]
[{"$f":"EingabeAngabe!B10","v":"SE3"},{"$f":"IF(EingabeAngabe!C10=\"\",\"\",EingabeAngabe!C10)","v":""},null,null,null,{"$f":"IF(OR(G6=\"\",G6>EingabeAngabe!F10),\"F\",EingabeAngabe!B10)","v":"F"},null,{"$f":"EingabeAngabe!B45","v":"IT5"},{"$f":"IF(EingabeAngabe!C45=\"\",\"\",EingabeAngabe!C45)","v":""},null,null,null,{"$f":"IF(N6>EingabeAngabe!F45,\"F\",IF(EingabeAngabe!F45=\"\",\"\",EingabeAngabe!F45))","v":2}]
[null,{"$f":"IF(EingabeAngabe!C11=\"\",\"\",EingabeAngabe!C11)","v":""},null,null,null,null,null,{"$f":"EingabeAngabe!B46","v":"IT6"},{"$f":"IF(EingabeAngabe!C46=\"\",\"\",EingabeAngabe!C46)","v":""},null,null,null,{"$f":"IF(N7>EingabeAngabe!F46,\"F\",IF(EingabeAngabe!F46=\"\",\"\",EingabeAngabe!F46))","v":2}]
[{"$f":"EingabeAngabe!B12","v":"SE4"},{"$f":"IF(EingabeAngabe!C12=\"\",\"\",EingabeAngabe!C12)","v":""},null,null,null,{"$f":"IF(OR(G8=\"\",G8>EingabeAngabe!F12),\"F\",EingabeAngabe!B12)","v":"F"},null,"Notenschlüssel:"]
[null,{"$f":"IF(EingabeAngabe!C13=\"\",\"\",EingabeAngabe!C13)","v":""},null,null,null,null,null,"Sehr gut",null,null,null,{"$f":"EingabeAngabe!F50","v":"40 - 36"}]
[{"$f":"EingabeAngabe!B14","v":"SE5"},{"$f":"IF(EingabeAngabe!C14=\"\",\"\",EingabeAngabe!C14)","v":""},null,null,null,{"$f":"IF(OR(G10=\"\",G10>EingabeAngabe!F14),\"F\",EingabeAngabe!B14)","v":"F"},null,"Gut",null,null,null,{"$f":"EingabeAngabe!F51","v":"35 - 31"}]
[null,{"$f":"IF(EingabeAngabe!C15=\"\",\"\",EingabeAngabe!C15)","v":""},null,null,null,null,null,"Befriedigend",null,null,null,{"$f":"EingabeAngabe!F52","v":"30 - 26"}]
[{"$f":"EingabeAngabe!B16","v":"SE6"},{"$f":"IF(EingabeAngabe!C16=\"\",\"\",EingabeAngabe!C16)","v":""},null,null,null,{"$f":"IF(OR(G12=\"\",G12>EingabeAngabe!F16),\"F\",EingabeAngabe!B16)","v":"F"},null,"Genügend",null,null,null,{"$f":"EingabeAngabe!F53","v":"25 - 20"}]
[null,{"$f":"IF(EingabeAngabe!C17=\"\",\"\",EingabeAngabe!C17)","v":""},null,null,null,null,null,"Nicht genügend",null,null,null,{"$f":"EingabeAngabe!F54","v":"19 - 00"}]
[{"$f":"EingabeAngabe!B18","v":"SE7"},{"$f":"IF(EingabeAngabe!C18=\"\",\"\",EingabeAngabe!C18)","v":""},null,null,null,{"$f":"IF(OR(G14=\"\",G14>EingabeAngabe!F18),\"F\",EingabeAngabe!B18)","v":"F"},null,{"$f":"CONCATENATE(\"Notendefinition laut LBVO$14:\",\"            \",K31)","v":"Notendefinition laut LBVO$14:            "}]
[null,{"$f":"IF(EingabeAngabe!C19=\"\",\"\",EingabeAngabe!C19)","v":""},null,null,null,null,null,{"$f":"VLOOKUP(K31,SchuelernamenEingabe!D2:'SchuelernamenEingabe'!E40,2,FALSE)","v":{"$error":"#N/A"}}]
[{"$f":"EingabeAngabe!B20","v":"SE8"},{"$f":"IF(EingabeAngabe!C20=\"\",\"\",EingabeAngabe!C20)","v":""},null,null,null,{"$f":"IF(OR(G16=\"\",G16>EingabeAngabe!F20),\"F\",EingabeAngabe!B20)","v":"F"}]
[null,{"$f":"IF(EingabeAngabe!C21=\"\",\"\",EingabeAngabe!C21)","v":""}]
[{"$f":"EingabeAngabe!B23","v":"LE13"},{"$f":"IF(EingabeAngabe!C23=\"\",\"\",EingabeAngabe!C23)","v":""},null,{"$f":"IF(EingabeAngabe!D23=\"\",\"\",EingabeAngabe!D23)","v":""},{"$f":"IF(EingabeAngabe!E23=\"\",\"\",EingabeAngabe!E23)","v":""},{"$f":"IF(OR(G18=\"\",G18>EingabeAngabe!F23),\"F\",EingabeAngabe!B23)","v":"F"}]
[{"$f":"EingabeAngabe!B24","v":"LE14"},{"$f":"IF(EingabeAngabe!C24=\"\",\"\",EingabeAngabe!C24)","v":""},null,{"$f":"IF(EingabeAngabe!D24=\"\",\"\",EingabeAngabe!D24)","v":""},{"$f":"IF(EingabeAngabe!E24=\"\",\"\",EingabeAngabe!E24)","v":""},{"$f":"IF(OR(G19=\"\",G19>EingabeAngabe!F24),\"F\",EingabeAngabe!B24)","v":"F"}]
[{"$f":"EingabeAngabe!B25","v":"LE15"},{"$f":"IF(EingabeAngabe!C25=\"\",\"\",EingabeAngabe!C25)","v":""},null,{"$f":"IF(EingabeAngabe!D25=\"\",\"\",EingabeAngabe!D25)","v":""},{"$f":"IF(EingabeAngabe!E25=\"\",\"\",EingabeAngabe!E25)","v":""},{"$f":"IF(OR(G20=\"\",G20>EingabeAngabe!F25),\"F\",EingabeAngabe!B25)","v":"F"}]
[{"$f":"EingabeAngabe!B26","v":"LE16"},{"$f":"IF(EingabeAngabe!C26=\"\",\"\",EingabeAngabe!C26)","v":""},null,{"$f":"IF(EingabeAngabe!D26=\"\",\"\",EingabeAngabe!D26)","v":""},{"$f":"IF(EingabeAngabe!E26=\"\",\"\",EingabeAngabe!E26)","v":""},{"$f":"IF(OR(G21=\"\",G21>EingabeAngabe!F26),\"F\",EingabeAngabe!B26)","v":"F"}]
[{"$f":"EingabeAngabe!B28","v":"MO19"},{"$f":"IF(EingabeAngabe!C28=\"\",\"\",EingabeAngabe!C28)","v":""},null,{"$f":"IF(EingabeAngabe!D28=\"\",\"\",EingabeAngabe!D28)","v":""},null,{"$f":"IF(OR(G22=\"\",G22>EingabeAngabe!F27),\"F\",EingabeAngabe!B28)","v":"F"}]
[{"$f":"EingabeAngabe!B29","v":"MO20"},{"$f":"IF(EingabeAngabe!C29=\"\",\"\",EingabeAngabe!C29)","v":""},null,{"$f":"IF(EingabeAngabe!D29=\"\",\"\",EingabeAngabe!D29)","v":""},null,{"$f":"IF(OR(G23=\"\",G23>EingabeAngabe!F28),\"F\",EingabeAngabe!B29)","v":"F"},null,{"$f":"IF(EingabeAngabe!F60>\"\",EingabeAngabe!E59,\"\")","v":"Eigener Notenkommentar:"}]
[{"$f":"EingabeAngabe!B30","v":"MO21"},{"$f":"IF(EingabeAngabe!C30=\"\",\"\",EingabeAngabe!C30)","v":""},null,{"$f":"IF(EingabeAngabe!D30=\"\",\"\",EingabeAngabe!D30)","v":""},null,{"$f":"IF(OR(G24=\"\",G24>EingabeAngabe!F29),\"F\",EingabeAngabe!B30)","v":"F"}]
[{"$f":"EingabeAngabe!B31","v":"MO22"},{"$f":"IF(EingabeAngabe!C31=\"\",\"\",EingabeAngabe!C31)","v":""},null,{"$f":"IF(EingabeAngabe!D31=\"\",\"\",EingabeAngabe!D31)","v":""},null,{"$f":"IF(OR(G25=\"\",G25>EingabeAngabe!F30),\"F\",EingabeAngabe!B31)","v":"F"}]
[{"$f":"EingabeAngabe!B33","v":"SY25"},{"$f":"IF(EingabeAngabe!C33=\"\",\"\",EingabeAngabe!C33)","v":""},null,{"$f":"IF(EingabeAngabe!D33=\"\",\"\",EingabeAngabe!D33)","v":""},null,{"$f":"IF(OR(G26=\"\",G26>EingabeAngabe!F31),\"F\",EingabeAngabe!B33)","v":"F"}]
[{"$f":"EingabeAngabe!B34","v":"SY26"},{"$f":"IF(EingabeAngabe!C34=\"\",\"\",EingabeAngabe!C34)","v":""},null,{"$f":"IF(EingabeAngabe!D34=\"\",\"\",EingabeAngabe!D34)","v":""},null,{"$f":"IF(OR(G27=\"\",G27>EingabeAngabe!F32),\"F\",EingabeAngabe!B34)","v":"F"}]
[{"$f":"EingabeAngabe!B35","v":"SY27"},{"$f":"IF(EingabeAngabe!C35=\"\",\"\",EingabeAngabe!C35)","v":""},null,{"$f":"IF(EingabeAngabe!D35=\"\",\"\",EingabeAngabe!D35)","v":""},null,{"$f":"IF(OR(G28=\"\",G28>EingabeAngabe!F33),\"F\",EingabeAngabe!B35)","v":"F"},null,"Summe Übersetzungstext",null,null,null,null,{"$f":"EingabeAngabe!AG39","v":""}]
[{"$f":"EingabeAngabe!B36","v":"SY28"},{"$f":"IF(EingabeAngabe!C36=\"\",\"\",EingabeAngabe!C36)","v":""},null,{"$f":"IF(EingabeAngabe!D36=\"\",\"\",EingabeAngabe!D36)","v":""},null,{"$f":"IF(OR(G29=\"\",G29>EingabeAngabe!F34),\"F\",EingabeAngabe!B36)","v":"F"},null,"Summe Arbeitsaufgaben und Interpretation",null,null,null,null,{"$f":"EingabeAngabe!AG40","v":""}]
[null,{"$f":"EingabeAngabe!C37","v":"SPRACHLICHE QUALITÄT IN DER ZIELSPRACHE"},null,null,null,{"$f":"IF(OR(G30=1,G30=3,G30=5,G30>5),\"F\",\"4/2/0\")","v":"4/2/0"},null,"Gesamtsumme",null,null,null,null,{"$f":"EingabeAngabe!AG2","v":""}]
[null,null,null,null,null,null,null,"NOTE",null,null,{"$f":"IF(EingabeAngabe!AG3=1,\"Sehr gut\",IF(EingabeAngabe!AG3=2,\"Gut\",IF(EingabeAngabe!AG3=3,\"Befriedigend\",IF(EingabeAngabe!AG3=4,\"Genügend\",IF(EingabeAngabe!AG3=5,\"Nicht genügend\",\"\")))))","v":""}]

{"sheet":"Schueler28Punkte","index":31,"n_rows":31,"n_cols":13,"rows_kept":31,"cut":false,"hidden":false,"merged":[[28,1,28,2],[29,1,29,3],[29,7,29,11],[29,12,29,13],[30,7,30,9],[30,10,30,13],[27,7,27,11],[27,12,27,13],[28,3,28,4],[28,7,28,11],[28,12,28,13],[22,7,22,10],[23,1,23,2],[23,3,23,4],[23,7,26,13],[24,1,24,2],[24,3,24,4],[25,3,25,4],[26,3,26,4],[22,1,22,2],[22,3,22,4],[25,1,25,2],[26,1,26,2],[27,1,27,2],[27,3,27,4],[15,0,16,0],[15,1,15,4],[15,5,16,5],[15,6,16,6],[16,1,16,4],[13,7,13,13],[14,7,21,13],[17,1,17,2],[18,1,18,2],[19,1,19,2],[20,1,20,2],[21,1,21,2],[21,3,21,4],[13,0,14,0],[13,1,13,4],[13,5,14,5],[13,6,14,6],[14,1,14,4],[10,11,10,13],[11,7,11,10],[11,11,11,13],[12,7,12,10],[12,11,12,13],[7,7,7,13],[8,7,8,10],[8,11,8,13],[11,0,12,0],[11,1,11,4],[11,5,12,5],[11,6,12,6],[12,1,12,4],[9,0,10,0],[9,1,9,4],[9,5,10,5],[9,6,10,6],[10,1,10,4],[9,7,9,10],[9,11,9,13],[10,7,10,10],[5,0,6,0],[5,1,5,4],[5,5,6,5],[5,6,6,6],[5,8,5,11],[6,1,6,4],[6,8,6,11],[7,0,8,0],[7,1,7,4],[7,5,8,5],[7,6,8,6],[8,1,8,4],[0,0,0,1],[0,3,0,4],[0,7,0,11],[1,0,2,0],[1,1,1,4],[1,5,2,5],[1,6,2,6],[1,8,1,11],[2,1,2,4],[2,8,2,11],[3,0,4,0],[3,1,3,4],[3,5,4,5],[3,6,4,6],[3,8,3,11],[4,1,4,4],[4,8,4,11]]}
["Übersetzungstext",null,"Schülername",{"$f":"SchuelernamenEingabe!B29","v":0},null,null,null,"Arbeitsaufgaben/ Interpretation"]
[{"$f":"EingabeAngabe!B6","v":"SE1"},{"$f":"IF(EingabeAngabe!C6=\"\",\"\",EingabeAngabe!C6)","v":""},null,null,null,{"$f":"IF(OR(G2=\"\",G2>EingabeAngabe!F6),\"F\",EingabeAngabe!B6)","v":"F"},null,{"$f":"EingabeAngabe!B41","v":"IT1"},{"$f":"IF(EingabeAngabe!C41=\"\",\"\",EingabeAngabe!C41)","v":""},null,null,null,{"$f":"IF(N2>EingabeAngabe!F41,\"F\",IF(EingabeAngabe!F41=\"\",\"\",EingabeAngabe!F41))","v":4}]
[null,{"$f":"IF(EingabeAngabe!C7=\"\",\"\",EingabeAngabe!C7)","v":""},null,null,null,null,null,{"$f":"EingabeAngabe!B42","v":"IT2"},{"$f":"IF(EingabeAngabe!C42=\"\",\"\",EingabeAngabe!C42)","v":""},null,null,null,{"$f":"IF(N3>EingabeAngabe!F42,\"F\",IF(EingabeAngabe!F42=\"\",\"\",EingabeAngabe!F42))","v":4}]
[{"$f":"EingabeAngabe!B8","v":"SE2"},{"$f":"IF(EingabeAngabe!C8=\"\",\"\",EingabeAngabe!C8)","v":""},null,null,null,{"$f":"IF(OR(G4=\"\",G4>EingabeAngabe!F8),\"F\",EingabeAngabe!B8)","v":"F"},null,{"$f":"EingabeAngabe!B43","v":"IT3"},{"$f":"IF(EingabeAngabe!C43=\"\",\"\",EingabeAngabe!C43)","v":""},null,null,null,{"$f":"IF(N4>EingabeAngabe!F43,\"F\",IF(EingabeAngabe!F43=\"\",\"\",EingabeAngabe!F43))","v":2}]
[null,{"$f":"IF(EingabeAngabe!C9=\"\",\"\",EingabeAngabe!C9)","v":""},null,null,null,null,null,{"$f":"EingabeAngabe!B44","v":"IT4"},{"$f":"IF(EingabeAngabe!C44=\"\",\"\",EingabeAngabe!C44)","v":""},null,null,null,{"$f":"IF(N5>EingabeAngabe!F44,\"F\",IF(EingabeAngabe!F44=\"\",\"\",EingabeAngabe!F44))","v":2}]
[{"$f":"EingabeAngabe!B10","v":"SE3"},{"$f":"IF(EingabeAngabe!C10=\"\",\"\",EingabeAngabe!C10)","v":""},null,null,null,{"$f":"IF(OR(G6=\"\",G6>EingabeAngabe!F10),\"F\",EingabeAngabe!B10)","v":"F"},null,{"$f":"EingabeAngabe!B45","v":"IT5"},{"$f":"IF(EingabeAngabe!C45=\"\",\"\",EingabeAngabe!C45)","v":""},null,null,null,{"$f":"IF(N6>EingabeAngabe!F45,\"F\",IF(EingabeAngabe!F45=\"\",\"\",EingabeAngabe!F45))","v":2}]
[null,{"$f":"IF(EingabeAngabe!C11=\"\",\"\",EingabeAngabe!C11)","v":""},null,null,null,null,null,{"$f":"EingabeAngabe!B46","v":"IT6"},{"$f":"IF(EingabeAngabe!C46=\"\",\"\",EingabeAngabe!C46)","v":""},null,null,null,{"$f":"IF(N7>EingabeAngabe!F46,\"F\",IF(EingabeAngabe!F46=\"\",\"\",EingabeAngabe!F46))","v":2}]
[{"$f":"EingabeAngabe!B12","v":"SE4"},{"$f":"IF(EingabeAngabe!C12=\"\",\"\",EingabeAngabe!C12)","v":""},null,null,null,{"$f":"IF(OR(G8=\"\",G8>EingabeAngabe!F12),\"F\",EingabeAngabe!B12)","v":"F"},null,"Notenschlüssel:"]
[null,{"$f":"IF(EingabeAngabe!C13=\"\",\"\",EingabeAngabe!C13)","v":""},null,null,null,null,null,"Sehr gut",null,null,null,{"$f":"EingabeAngabe!F50","v":"40 - 36"}]
[{"$f":"EingabeAngabe!B14","v":"SE5"},{"$f":"IF(EingabeAngabe!C14=\"\",\"\",EingabeAngabe!C14)","v":""},null,null,null,{"$f":"IF(OR(G10=\"\",G10>EingabeAngabe!F14),\"F\",EingabeAngabe!B14)","v":"F"},null,"Gut",null,null,null,{"$f":"EingabeAngabe!F51","v":"35 - 31"}]
[null,{"$f":"IF(EingabeAngabe!C15=\"\",\"\",EingabeAngabe!C15)","v":""},null,null,null,null,null,"Befriedigend",null,null,null,{"$f":"EingabeAngabe!F52","v":"30 - 26"}]
[{"$f":"EingabeAngabe!B16","v":"SE6"},{"$f":"IF(EingabeAngabe!C16=\"\",\"\",EingabeAngabe!C16)","v":""},null,null,null,{"$f":"IF(OR(G12=\"\",G12>EingabeAngabe!F16),\"F\",EingabeAngabe!B16)","v":"F"},null,"Genügend",null,null,null,{"$f":"EingabeAngabe!F53","v":"25 - 20"}]
[null,{"$f":"IF(EingabeAngabe!C17=\"\",\"\",EingabeAngabe!C17)","v":""},null,null,null,null,null,"Nicht genügend",null,null,null,{"$f":"EingabeAngabe!F54","v":"19 - 00"}]
[{"$f":"EingabeAngabe!B18","v":"SE7"},{"$f":"IF(EingabeAngabe!C18=\"\",\"\",EingabeAngabe!C18)","v":""},null,null,null,{"$f":"IF(OR(G14=\"\",G14>EingabeAngabe!F18),\"F\",EingabeAngabe!B18)","v":"F"},null,{"$f":"CONCATENATE(\"Notendefinition laut LBVO$14:\",\"            \",K31)","v":"Notendefinition laut LBVO$14:            "}]
[null,{"$f":"IF(EingabeAngabe!C19=\"\",\"\",EingabeAngabe!C19)","v":""},null,null,null,null,null,{"$f":"VLOOKUP(K31,SchuelernamenEingabe!D2:'SchuelernamenEingabe'!E40,2,FALSE)","v":{"$error":"#N/A"}}]
[{"$f":"EingabeAngabe!B20","v":"SE8"},{"$f":"IF(EingabeAngabe!C20=\"\",\"\",EingabeAngabe!C20)","v":""},null,null,null,{"$f":"IF(OR(G16=\"\",G16>EingabeAngabe!F20),\"F\",EingabeAngabe!B20)","v":"F"}]
[null,{"$f":"IF(EingabeAngabe!C21=\"\",\"\",EingabeAngabe!C21)","v":""}]
[{"$f":"EingabeAngabe!B23","v":"LE13"},{"$f":"IF(EingabeAngabe!C23=\"\",\"\",EingabeAngabe!C23)","v":""},null,{"$f":"IF(EingabeAngabe!D23=\"\",\"\",EingabeAngabe!D23)","v":""},{"$f":"IF(EingabeAngabe!E23=\"\",\"\",EingabeAngabe!E23)","v":""},{"$f":"IF(OR(G18=\"\",G18>EingabeAngabe!F23),\"F\",EingabeAngabe!B23)","v":"F"}]
[{"$f":"EingabeAngabe!B24","v":"LE14"},{"$f":"IF(EingabeAngabe!C24=\"\",\"\",EingabeAngabe!C24)","v":""},null,{"$f":"IF(EingabeAngabe!D24=\"\",\"\",EingabeAngabe!D24)","v":""},{"$f":"IF(EingabeAngabe!E24=\"\",\"\",EingabeAngabe!E24)","v":""},{"$f":"IF(OR(G19=\"\",G19>EingabeAngabe!F24),\"F\",EingabeAngabe!B24)","v":"F"}]
[{"$f":"EingabeAngabe!B25","v":"LE15"},{"$f":"IF(EingabeAngabe!C25=\"\",\"\",EingabeAngabe!C25)","v":""},null,{"$f":"IF(EingabeAngabe!D25=\"\",\"\",EingabeAngabe!D25)","v":""},{"$f":"IF(EingabeAngabe!E25=\"\",\"\",EingabeAngabe!E25)","v":""},{"$f":"IF(OR(G20=\"\",G20>EingabeAngabe!F25),\"F\",EingabeAngabe!B25)","v":"F"}]
[{"$f":"EingabeAngabe!B26","v":"LE16"},{"$f":"IF(EingabeAngabe!C26=\"\",\"\",EingabeAngabe!C26)","v":""},null,{"$f":"IF(EingabeAngabe!D26=\"\",\"\",EingabeAngabe!D26)","v":""},{"$f":"IF(EingabeAngabe!E26=\"\",\"\",EingabeAngabe!E26)","v":""},{"$f":"IF(OR(G21=\"\",G21>EingabeAngabe!F26),\"F\",EingabeAngabe!B26)","v":"F"}]
[{"$f":"EingabeAngabe!B28","v":"MO19"},{"$f":"IF(EingabeAngabe!C28=\"\",\"\",EingabeAngabe!C28)","v":""},null,{"$f":"IF(EingabeAngabe!D28=\"\",\"\",EingabeAngabe!D28)","v":""},null,{"$f":"IF(OR(G22=\"\",G22>EingabeAngabe!F27),\"F\",EingabeAngabe!B28)","v":"F"}]
[{"$f":"EingabeAngabe!B29","v":"MO20"},{"$f":"IF(EingabeAngabe!C29=\"\",\"\",EingabeAngabe!C29)","v":""},null,{"$f":"IF(EingabeAngabe!D29=\"\",\"\",EingabeAngabe!D29)","v":""},null,{"$f":"IF(OR(G23=\"\",G23>EingabeAngabe!F28),\"F\",EingabeAngabe!B29)","v":"F"},null,{"$f":"IF(EingabeAngabe!F60>\"\",EingabeAngabe!E59,\"\")","v":"Eigener Notenkommentar:"}]
[{"$f":"EingabeAngabe!B30","v":"MO21"},{"$f":"IF(EingabeAngabe!C30=\"\",\"\",EingabeAngabe!C30)","v":""},null,{"$f":"IF(EingabeAngabe!D30=\"\",\"\",EingabeAngabe!D30)","v":""},null,{"$f":"IF(OR(G24=\"\",G24>EingabeAngabe!F29),\"F\",EingabeAngabe!B30)","v":"F"}]
[{"$f":"EingabeAngabe!B31","v":"MO22"},{"$f":"IF(EingabeAngabe!C31=\"\",\"\",EingabeAngabe!C31)","v":""},null,{"$f":"IF(EingabeAngabe!D31=\"\",\"\",EingabeAngabe!D31)","v":""},null,{"$f":"IF(OR(G25=\"\",G25>EingabeAngabe!F30),\"F\",EingabeAngabe!B31)","v":"F"}]
[{"$f":"EingabeAngabe!B33","v":"SY25"},{"$f":"IF(EingabeAngabe!C33=\"\",\"\",EingabeAngabe!C33)","v":""},null,{"$f":"IF(EingabeAngabe!D33=\"\",\"\",EingabeAngabe!D33)","v":""},null,{"$f":"IF(OR(G26=\"\",G26>EingabeAngabe!F31),\"F\",EingabeAngabe!B33)","v":"F"}]
[{"$f":"EingabeAngabe!B34","v":"SY26"},{"$f":"IF(EingabeAngabe!C34=\"\",\"\",EingabeAngabe!C34)","v":""},null,{"$f":"IF(EingabeAngabe!D34=\"\",\"\",EingabeAngabe!D34)","v":""},null,{"$f":"IF(OR(G27=\"\",G27>EingabeAngabe!F32),\"F\",EingabeAngabe!B34)","v":"F"}]
[{"$f":"EingabeAngabe!B35","v":"SY27"},{"$f":"IF(EingabeAngabe!C35=\"\",\"\",EingabeAngabe!C35)","v":""},null,{"$f":"IF(EingabeAngabe!D35=\"\",\"\",EingabeAngabe!D35)","v":""},null,{"$f":"IF(OR(G28=\"\",G28>EingabeAngabe!F33),\"F\",EingabeAngabe!B35)","v":"F"},null,"Summe Übersetzungstext",null,null,null,null,{"$f":"EingabeAngabe!AH39","v":""}]
[{"$f":"EingabeAngabe!B36","v":"SY28"},{"$f":"IF(EingabeAngabe!C36=\"\",\"\",EingabeAngabe!C36)","v":""},null,{"$f":"IF(EingabeAngabe!D36=\"\",\"\",EingabeAngabe!D36)","v":""},null,{"$f":"IF(OR(G29=\"\",G29>EingabeAngabe!F34),\"F\",EingabeAngabe!B36)","v":"F"},null,"Summe Arbeitsaufgaben und Interpretation",null,null,null,null,{"$f":"EingabeAngabe!AH40","v":""}]
[null,{"$f":"EingabeAngabe!C37","v":"SPRACHLICHE QUALITÄT IN DER ZIELSPRACHE"},null,null,null,{"$f":"IF(OR(G30=1,G30=3,G30=5,G30>5),\"F\",\"4/2/0\")","v":"4/2/0"},null,"Gesamtsumme",null,null,null,null,{"$f":"EingabeAngabe!AH2","v":""}]
[null,null,null,null,null,null,null,"NOTE",null,null,{"$f":"IF(EingabeAngabe!AH3=1,\"Sehr gut\",IF(EingabeAngabe!AH3=2,\"Gut\",IF(EingabeAngabe!AH3=3,\"Befriedigend\",IF(EingabeAngabe!AH3=4,\"Genügend\",IF(EingabeAngabe!AH3=5,\"Nicht genügend\",\"\")))))","v":""}]

{"sheet":"Schueler29Punkte","index":32,"n_rows":31,"n_cols":13,"rows_kept":31,"cut":false,"hidden":false,"merged":[[28,1,28,2],[29,1,29,3],[29,7,29,11],[29,12,29,13],[30,7,30,9],[30,10,30,13],[27,7,27,11],[27,12,27,13],[28,3,28,4],[28,7,28,11],[28,12,28,13],[22,7,22,10],[23,1,23,2],[23,3,23,4],[23,7,26,13],[24,1,24,2],[24,3,24,4],[25,3,25,4],[26,3,26,4],[22,1,22,2],[22,3,22,4],[25,1,25,2],[26,1,26,2],[27,1,27,2],[27,3,27,4],[15,0,16,0],[15,1,15,4],[15,5,16,5],[15,6,16,6],[16,1,16,4],[13,7,13,13],[14,7,21,13],[17,1,17,2],[18,1,18,2],[19,1,19,2],[20,1,20,2],[21,1,21,2],[21,3,21,4],[13,0,14,0],[13,1,13,4],[13,5,14,5],[13,6,14,6],[14,1,14,4],[10,11,10,13],[11,7,11,10],[11,11,11,13],[12,7,12,10],[12,11,12,13],[7,7,7,13],[8,7,8,10],[8,11,8,13],[11,0,12,0],[11,1,11,4],[11,5,12,5],[11,6,12,6],[12,1,12,4],[9,0,10,0],[9,1,9,4],[9,5,10,5],[9,6,10,6],[10,1,10,4],[9,7,9,10],[9,11,9,13],[10,7,10,10],[5,0,6,0],[5,1,5,4],[5,5,6,5],[5,6,6,6],[5,8,5,11],[6,1,6,4],[6,8,6,11],[7,0,8,0],[7,1,7,4],[7,5,8,5],[7,6,8,6],[8,1,8,4],[0,0,0,1],[0,3,0,4],[0,7,0,11],[1,0,2,0],[1,1,1,4],[1,5,2,5],[1,6,2,6],[1,8,1,11],[2,1,2,4],[2,8,2,11],[3,0,4,0],[3,1,3,4],[3,5,4,5],[3,6,4,6],[3,8,3,11],[4,1,4,4],[4,8,4,11]]}
["Übersetzungstext",null,"Schülername",{"$f":"SchuelernamenEingabe!B30","v":0},null,null,null,"Arbeitsaufgaben/ Interpretation"]
[{"$f":"EingabeAngabe!B6","v":"SE1"},{"$f":"IF(EingabeAngabe!C6=\"\",\"\",EingabeAngabe!C6)","v":""},null,null,null,{"$f":"IF(OR(G2=\"\",G2>EingabeAngabe!F6),\"F\",EingabeAngabe!B6)","v":"F"},null,{"$f":"EingabeAngabe!B41","v":"IT1"},{"$f":"IF(EingabeAngabe!C41=\"\",\"\",EingabeAngabe!C41)","v":""},null,null,null,{"$f":"IF(N2>EingabeAngabe!F41,\"F\",IF(EingabeAngabe!F41=\"\",\"\",EingabeAngabe!F41))","v":4}]
[null,{"$f":"IF(EingabeAngabe!C7=\"\",\"\",EingabeAngabe!C7)","v":""},null,null,null,null,null,{"$f":"EingabeAngabe!B42","v":"IT2"},{"$f":"IF(EingabeAngabe!C42=\"\",\"\",EingabeAngabe!C42)","v":""},null,null,null,{"$f":"IF(N3>EingabeAngabe!F42,\"F\",IF(EingabeAngabe!F42=\"\",\"\",EingabeAngabe!F42))","v":4}]
[{"$f":"EingabeAngabe!B8","v":"SE2"},{"$f":"IF(EingabeAngabe!C8=\"\",\"\",EingabeAngabe!C8)","v":""},null,null,null,{"$f":"IF(OR(G4=\"\",G4>EingabeAngabe!F8),\"F\",EingabeAngabe!B8)","v":"F"},null,{"$f":"EingabeAngabe!B43","v":"IT3"},{"$f":"IF(EingabeAngabe!C43=\"\",\"\",EingabeAngabe!C43)","v":""},null,null,null,{"$f":"IF(N4>EingabeAngabe!F43,\"F\",IF(EingabeAngabe!F43=\"\",\"\",EingabeAngabe!F43))","v":2}]
[null,{"$f":"IF(EingabeAngabe!C9=\"\",\"\",EingabeAngabe!C9)","v":""},null,null,null,null,null,{"$f":"EingabeAngabe!B44","v":"IT4"},{"$f":"IF(EingabeAngabe!C44=\"\",\"\",EingabeAngabe!C44)","v":""},null,null,null,{"$f":"IF(N5>EingabeAngabe!F44,\"F\",IF(EingabeAngabe!F44=\"\",\"\",EingabeAngabe!F44))","v":2}]
[{"$f":"EingabeAngabe!B10","v":"SE3"},{"$f":"IF(EingabeAngabe!C10=\"\",\"\",EingabeAngabe!C10)","v":""},null,null,null,{"$f":"IF(OR(G6=\"\",G6>EingabeAngabe!F10),\"F\",EingabeAngabe!B10)","v":"F"},null,{"$f":"EingabeAngabe!B45","v":"IT5"},{"$f":"IF(EingabeAngabe!C45=\"\",\"\",EingabeAngabe!C45)","v":""},null,null,null,{"$f":"IF(N6>EingabeAngabe!F45,\"F\",IF(EingabeAngabe!F45=\"\",\"\",EingabeAngabe!F45))","v":2}]
[null,{"$f":"IF(EingabeAngabe!C11=\"\",\"\",EingabeAngabe!C11)","v":""},null,null,null,null,null,{"$f":"EingabeAngabe!B46","v":"IT6"},{"$f":"IF(EingabeAngabe!C46=\"\",\"\",EingabeAngabe!C46)","v":""},null,null,null,{"$f":"IF(N7>EingabeAngabe!F46,\"F\",IF(EingabeAngabe!F46=\"\",\"\",EingabeAngabe!F46))","v":2}]
[{"$f":"EingabeAngabe!B12","v":"SE4"},{"$f":"IF(EingabeAngabe!C12=\"\",\"\",EingabeAngabe!C12)","v":""},null,null,null,{"$f":"IF(OR(G8=\"\",G8>EingabeAngabe!F12),\"F\",EingabeAngabe!B12)","v":"F"},null,"Notenschlüssel:"]
[null,{"$f":"IF(EingabeAngabe!C13=\"\",\"\",EingabeAngabe!C13)","v":""},null,null,null,null,null,"Sehr gut",null,null,null,{"$f":"EingabeAngabe!F50","v":"40 - 36"}]
[{"$f":"EingabeAngabe!B14","v":"SE5"},{"$f":"IF(EingabeAngabe!C14=\"\",\"\",EingabeAngabe!C14)","v":""},null,null,null,{"$f":"IF(OR(G10=\"\",G10>EingabeAngabe!F14),\"F\",EingabeAngabe!B14)","v":"F"},null,"Gut",null,null,null,{"$f":"EingabeAngabe!F51","v":"35 - 31"}]
[null,{"$f":"IF(EingabeAngabe!C15=\"\",\"\",EingabeAngabe!C15)","v":""},null,null,null,null,null,"Befriedigend",null,null,null,{"$f":"EingabeAngabe!F52","v":"30 - 26"}]
[{"$f":"EingabeAngabe!B16","v":"SE6"},{"$f":"IF(EingabeAngabe!C16=\"\",\"\",EingabeAngabe!C16)","v":""},null,null,null,{"$f":"IF(OR(G12=\"\",G12>EingabeAngabe!F16),\"F\",EingabeAngabe!B16)","v":"F"},null,"Genügend",null,null,null,{"$f":"EingabeAngabe!F53","v":"25 - 20"}]
[null,{"$f":"IF(EingabeAngabe!C17=\"\",\"\",EingabeAngabe!C17)","v":""},null,null,null,null,null,"Nicht genügend",null,null,null,{"$f":"EingabeAngabe!F54","v":"19 - 00"}]
[{"$f":"EingabeAngabe!B18","v":"SE7"},{"$f":"IF(EingabeAngabe!C18=\"\",\"\",EingabeAngabe!C18)","v":""},null,null,null,{"$f":"IF(OR(G14=\"\",G14>EingabeAngabe!F18),\"F\",EingabeAngabe!B18)","v":"F"},null,{"$f":"CONCATENATE(\"Notendefinition laut LBVO$14:\",\"            \",K31)","v":"Notendefinition laut LBVO$14:            "}]
[null,{"$f":"IF(EingabeAngabe!C19=\"\",\"\",EingabeAngabe!C19)","v":""},null,null,null,null,null,{"$f":"VLOOKUP(K31,SchuelernamenEingabe!D2:'SchuelernamenEingabe'!E40,2,FALSE)","v":{"$error":"#N/A"}}]
[{"$f":"EingabeAngabe!B20","v":"SE8"},{"$f":"IF(EingabeAngabe!C20=\"\",\"\",EingabeAngabe!C20)","v":""},null,null,null,{"$f":"IF(OR(G16=\"\",G16>EingabeAngabe!F20),\"F\",EingabeAngabe!B20)","v":"F"}]
[null,{"$f":"IF(EingabeAngabe!C21=\"\",\"\",EingabeAngabe!C21)","v":""}]
[{"$f":"EingabeAngabe!B23","v":"LE13"},{"$f":"IF(EingabeAngabe!C23=\"\",\"\",EingabeAngabe!C23)","v":""},null,{"$f":"IF(EingabeAngabe!D23=\"\",\"\",EingabeAngabe!D23)","v":""},{"$f":"IF(EingabeAngabe!E23=\"\",\"\",EingabeAngabe!E23)","v":""},{"$f":"IF(OR(G18=\"\",G18>EingabeAngabe!F23),\"F\",EingabeAngabe!B23)","v":"F"}]
[{"$f":"EingabeAngabe!B24","v":"LE14"},{"$f":"IF(EingabeAngabe!C24=\"\",\"\",EingabeAngabe!C24)","v":""},null,{"$f":"IF(EingabeAngabe!D24=\"\",\"\",EingabeAngabe!D24)","v":""},{"$f":"IF(EingabeAngabe!E24=\"\",\"\",EingabeAngabe!E24)","v":""},{"$f":"IF(OR(G19=\"\",G19>EingabeAngabe!F24),\"F\",EingabeAngabe!B24)","v":"F"}]
[{"$f":"EingabeAngabe!B25","v":"LE15"},{"$f":"IF(EingabeAngabe!C25=\"\",\"\",EingabeAngabe!C25)","v":""},null,{"$f":"IF(EingabeAngabe!D25=\"\",\"\",EingabeAngabe!D25)","v":""},{"$f":"IF(EingabeAngabe!E25=\"\",\"\",EingabeAngabe!E25)","v":""},{"$f":"IF(OR(G20=\"\",G20>EingabeAngabe!F25),\"F\",EingabeAngabe!B25)","v":"F"}]
[{"$f":"EingabeAngabe!B26","v":"LE16"},{"$f":"IF(EingabeAngabe!C26=\"\",\"\",EingabeAngabe!C26)","v":""},null,{"$f":"IF(EingabeAngabe!D26=\"\",\"\",EingabeAngabe!D26)","v":""},{"$f":"IF(EingabeAngabe!E26=\"\",\"\",EingabeAngabe!E26)","v":""},{"$f":"IF(OR(G21=\"\",G21>EingabeAngabe!F26),\"F\",EingabeAngabe!B26)","v":"F"}]
[{"$f":"EingabeAngabe!B28","v":"MO19"},{"$f":"IF(EingabeAngabe!C28=\"\",\"\",EingabeAngabe!C28)","v":""},null,{"$f":"IF(EingabeAngabe!D28=\"\",\"\",EingabeAngabe!D28)","v":""},null,{"$f":"IF(OR(G22=\"\",G22>EingabeAngabe!F27),\"F\",EingabeAngabe!B28)","v":"F"}]
[{"$f":"EingabeAngabe!B29","v":"MO20"},{"$f":"IF(EingabeAngabe!C29=\"\",\"\",EingabeAngabe!C29)","v":""},null,{"$f":"IF(EingabeAngabe!D29=\"\",\"\",EingabeAngabe!D29)","v":""},null,{"$f":"IF(OR(G23=\"\",G23>EingabeAngabe!F28),\"F\",EingabeAngabe!B29)","v":"F"},null,{"$f":"IF(EingabeAngabe!F60>\"\",EingabeAngabe!E59,\"\")","v":"Eigener Notenkommentar:"}]
[{"$f":"EingabeAngabe!B30","v":"MO21"},{"$f":"IF(EingabeAngabe!C30=\"\",\"\",EingabeAngabe!C30)","v":""},null,{"$f":"IF(EingabeAngabe!D30=\"\",\"\",EingabeAngabe!D30)","v":""},null,{"$f":"IF(OR(G24=\"\",G24>EingabeAngabe!F29),\"F\",EingabeAngabe!B30)","v":"F"}]
[{"$f":"EingabeAngabe!B31","v":"MO22"},{"$f":"IF(EingabeAngabe!C31=\"\",\"\",EingabeAngabe!C31)","v":""},null,{"$f":"IF(EingabeAngabe!D31=\"\",\"\",EingabeAngabe!D31)","v":""},null,{"$f":"IF(OR(G25=\"\",G25>EingabeAngabe!F30),\"F\",EingabeAngabe!B31)","v":"F"}]
[{"$f":"EingabeAngabe!B33","v":"SY25"},{"$f":"IF(EingabeAngabe!C33=\"\",\"\",EingabeAngabe!C33)","v":""},null,{"$f":"IF(EingabeAngabe!D33=\"\",\"\",EingabeAngabe!D33)","v":""},null,{"$f":"IF(OR(G26=\"\",G26>EingabeAngabe!F31),\"F\",EingabeAngabe!B33)","v":"F"}]
[{"$f":"EingabeAngabe!B34","v":"SY26"},{"$f":"IF(EingabeAngabe!C34=\"\",\"\",EingabeAngabe!C34)","v":""},null,{"$f":"IF(EingabeAngabe!D34=\"\",\"\",EingabeAngabe!D34)","v":""},null,{"$f":"IF(OR(G27=\"\",G27>EingabeAngabe!F32),\"F\",EingabeAngabe!B34)","v":"F"}]
[{"$f":"EingabeAngabe!B35","v":"SY27"},{"$f":"IF(EingabeAngabe!C35=\"\",\"\",EingabeAngabe!C35)","v":""},null,{"$f":"IF(EingabeAngabe!D35=\"\",\"\",EingabeAngabe!D35)","v":""},null,{"$f":"IF(OR(G28=\"\",G28>EingabeAngabe!F33),\"F\",EingabeAngabe!B35)","v":"F"},null,"Summe Übersetzungstext",null,null,null,null,{"$f":"EingabeAngabe!AI39","v":""}]
[{"$f":"EingabeAngabe!B36","v":"SY28"},{"$f":"IF(EingabeAngabe!C36=\"\",\"\",EingabeAngabe!C36)","v":""},null,{"$f":"IF(EingabeAngabe!D36=\"\",\"\",EingabeAngabe!D36)","v":""},null,{"$f":"IF(OR(G29=\"\",G29>EingabeAngabe!F34),\"F\",EingabeAngabe!B36)","v":"F"},null,"Summe Arbeitsaufgaben und Interpretation",null,null,null,null,{"$f":"EingabeAngabe!AI40","v":""}]
[null,{"$f":"EingabeAngabe!C37","v":"SPRACHLICHE QUALITÄT IN DER ZIELSPRACHE"},null,null,null,{"$f":"IF(OR(G30=1,G30=3,G30=5,G30>5),\"F\",\"4/2/0\")","v":"4/2/0"},null,"Gesamtsumme",null,null,null,null,{"$f":"EingabeAngabe!AI2","v":""}]
[null,null,null,null,null,null,null,"NOTE",null,null,{"$f":"IF(EingabeAngabe!AI3=1,\"Sehr gut\",IF(EingabeAngabe!AI3=2,\"Gut\",IF(EingabeAngabe!AI3=3,\"Befriedigend\",IF(EingabeAngabe!AI3=4,\"Genügend\",IF(EingabeAngabe!AI3=5,\"Nicht genügend\",\"\")))))","v":""}]

{"sheet":"Schueler30Punkte","index":33,"n_rows":31,"n_cols":13,"rows_kept":31,"cut":false,"hidden":false,"merged":[[28,1,28,2],[29,1,29,3],[29,7,29,11],[29,12,29,13],[30,7,30,9],[30,10,30,13],[27,7,27,11],[27,12,27,13],[28,3,28,4],[28,7,28,11],[28,12,28,13],[22,7,22,10],[23,1,23,2],[23,3,23,4],[23,7,26,13],[24,1,24,2],[24,3,24,4],[25,3,25,4],[26,3,26,4],[22,1,22,2],[22,3,22,4],[25,1,25,2],[26,1,26,2],[27,1,27,2],[27,3,27,4],[15,0,16,0],[15,1,15,4],[15,5,16,5],[15,6,16,6],[16,1,16,4],[13,7,13,13],[14,7,21,13],[17,1,17,2],[18,1,18,2],[19,1,19,2],[20,1,20,2],[21,1,21,2],[21,3,21,4],[13,0,14,0],[13,1,13,4],[13,5,14,5],[13,6,14,6],[14,1,14,4],[10,11,10,13],[11,7,11,10],[11,11,11,13],[12,7,12,10],[12,11,12,13],[7,7,7,13],[8,7,8,10],[8,11,8,13],[11,0,12,0],[11,1,11,4],[11,5,12,5],[11,6,12,6],[12,1,12,4],[9,0,10,0],[9,1,9,4],[9,5,10,5],[9,6,10,6],[10,1,10,4],[9,7,9,10],[9,11,9,13],[10,7,10,10],[5,0,6,0],[5,1,5,4],[5,5,6,5],[5,6,6,6],[5,8,5,11],[6,1,6,4],[6,8,6,11],[7,0,8,0],[7,1,7,4],[7,5,8,5],[7,6,8,6],[8,1,8,4],[0,0,0,1],[0,3,0,4],[0,7,0,11],[1,0,2,0],[1,1,1,4],[1,5,2,5],[1,6,2,6],[1,8,1,11],[2,1,2,4],[2,8,2,11],[3,0,4,0],[3,1,3,4],[3,5,4,5],[3,6,4,6],[3,8,3,11],[4,1,4,4],[4,8,4,11]]}
["Übersetzungstext",null,"Schülername",{"$f":"SchuelernamenEingabe!B31","v":0},null,null,null,"Arbeitsaufgaben/ Interpretation"]
[{"$f":"EingabeAngabe!B6","v":"SE1"},{"$f":"IF(EingabeAngabe!C6=\"\",\"\",EingabeAngabe!C6)","v":""},null,null,null,{"$f":"IF(OR(G2=\"\",G2>EingabeAngabe!F6),\"F\",EingabeAngabe!B6)","v":"F"},null,{"$f":"EingabeAngabe!B41","v":"IT1"},{"$f":"IF(EingabeAngabe!C41=\"\",\"\",EingabeAngabe!C41)","v":""},null,null,null,{"$f":"IF(N2>EingabeAngabe!F41,\"F\",IF(EingabeAngabe!F41=\"\",\"\",EingabeAngabe!F41))","v":4}]
[null,{"$f":"IF(EingabeAngabe!C7=\"\",\"\",EingabeAngabe!C7)","v":""},null,null,null,null,null,{"$f":"EingabeAngabe!B42","v":"IT2"},{"$f":"IF(EingabeAngabe!C42=\"\",\"\",EingabeAngabe!C42)","v":""},null,null,null,{"$f":"IF(N3>EingabeAngabe!F42,\"F\",IF(EingabeAngabe!F42=\"\",\"\",EingabeAngabe!F42))","v":4}]
[{"$f":"EingabeAngabe!B8","v":"SE2"},{"$f":"IF(EingabeAngabe!C8=\"\",\"\",EingabeAngabe!C8)","v":""},null,null,null,{"$f":"IF(OR(G4=\"\",G4>EingabeAngabe!F8),\"F\",EingabeAngabe!B8)","v":"F"},null,{"$f":"EingabeAngabe!B43","v":"IT3"},{"$f":"IF(EingabeAngabe!C43=\"\",\"\",EingabeAngabe!C43)","v":""},null,null,null,{"$f":"IF(N4>EingabeAngabe!F43,\"F\",IF(EingabeAngabe!F43=\"\",\"\",EingabeAngabe!F43))","v":2}]
[null,{"$f":"IF(EingabeAngabe!C9=\"\",\"\",EingabeAngabe!C9)","v":""},null,null,null,null,null,{"$f":"EingabeAngabe!B44","v":"IT4"},{"$f":"IF(EingabeAngabe!C44=\"\",\"\",EingabeAngabe!C44)","v":""},null,null,null,{"$f":"IF(N5>EingabeAngabe!F44,\"F\",IF(EingabeAngabe!F44=\"\",\"\",EingabeAngabe!F44))","v":2}]
[{"$f":"EingabeAngabe!B10","v":"SE3"},{"$f":"IF(EingabeAngabe!C10=\"\",\"\",EingabeAngabe!C10)","v":""},null,null,null,{"$f":"IF(OR(G6=\"\",G6>EingabeAngabe!F10),\"F\",EingabeAngabe!B10)","v":"F"},null,{"$f":"EingabeAngabe!B45","v":"IT5"},{"$f":"IF(EingabeAngabe!C45=\"\",\"\",EingabeAngabe!C45)","v":""},null,null,null,{"$f":"IF(N6>EingabeAngabe!F45,\"F\",IF(EingabeAngabe!F45=\"\",\"\",EingabeAngabe!F45))","v":2}]
[null,{"$f":"IF(EingabeAngabe!C11=\"\",\"\",EingabeAngabe!C11)","v":""},null,null,null,null,null,{"$f":"EingabeAngabe!B46","v":"IT6"},{"$f":"IF(EingabeAngabe!C46=\"\",\"\",EingabeAngabe!C46)","v":""},null,null,null,{"$f":"IF(N7>EingabeAngabe!F46,\"F\",IF(EingabeAngabe!F46=\"\",\"\",EingabeAngabe!F46))","v":2}]
[{"$f":"EingabeAngabe!B12","v":"SE4"},{"$f":"IF(EingabeAngabe!C12=\"\",\"\",EingabeAngabe!C12)","v":""},null,null,null,{"$f":"IF(OR(G8=\"\",G8>EingabeAngabe!F12),\"F\",EingabeAngabe!B12)","v":"F"},null,"Notenschlüssel:"]
[null,{"$f":"IF(EingabeAngabe!C13=\"\",\"\",EingabeAngabe!C13)","v":""},null,null,null,null,null,"Sehr gut",null,null,null,{"$f":"EingabeAngabe!F50","v":"40 - 36"}]
[{"$f":"EingabeAngabe!B14","v":"SE5"},{"$f":"IF(EingabeAngabe!C14=\"\",\"\",EingabeAngabe!C14)","v":""},null,null,null,{"$f":"IF(OR(G10=\"\",G10>EingabeAngabe!F14),\"F\",EingabeAngabe!B14)","v":"F"},null,"Gut",null,null,null,{"$f":"EingabeAngabe!F51","v":"35 - 31"}]
[null,{"$f":"IF(EingabeAngabe!C15=\"\",\"\",EingabeAngabe!C15)","v":""},null,null,null,null,null,"Befriedigend",null,null,null,{"$f":"EingabeAngabe!F52","v":"30 - 26"}]
[{"$f":"EingabeAngabe!B16","v":"SE6"},{"$f":"IF(EingabeAngabe!C16=\"\",\"\",EingabeAngabe!C16)","v":""},null,null,null,{"$f":"IF(OR(G12=\"\",G12>EingabeAngabe!F16),\"F\",EingabeAngabe!B16)","v":"F"},null,"Genügend",null,null,null,{"$f":"EingabeAngabe!F53","v":"25 - 20"}]
[null,{"$f":"IF(EingabeAngabe!C17=\"\",\"\",EingabeAngabe!C17)","v":""},null,null,null,null,null,"Nicht genügend",null,null,null,{"$f":"EingabeAngabe!F54","v":"19 - 00"}]
[{"$f":"EingabeAngabe!B18","v":"SE7"},{"$f":"IF(EingabeAngabe!C18=\"\",\"\",EingabeAngabe!C18)","v":""},null,null,null,{"$f":"IF(OR(G14=\"\",G14>EingabeAngabe!F18),\"F\",EingabeAngabe!B18)","v":"F"},null,{"$f":"CONCATENATE(\"Notendefinition laut LBVO$14:\",\"            \",K31)","v":"Notendefinition laut LBVO$14:            "}]
[null,{"$f":"IF(EingabeAngabe!C19=\"\",\"\",EingabeAngabe!C19)","v":""},null,null,null,null,null,{"$f":"VLOOKUP(K31,SchuelernamenEingabe!D2:'SchuelernamenEingabe'!E40,2,FALSE)","v":{"$error":"#N/A"}}]
[{"$f":"EingabeAngabe!B20","v":"SE8"},{"$f":"IF(EingabeAngabe!C20=\"\",\"\",EingabeAngabe!C20)","v":""},null,null,null,{"$f":"IF(OR(G16=\"\",G16>EingabeAngabe!F20),\"F\",EingabeAngabe!B20)","v":"F"}]
[null,{"$f":"IF(EingabeAngabe!C21=\"\",\"\",EingabeAngabe!C21)","v":""}]
[{"$f":"EingabeAngabe!B23","v":"LE13"},{"$f":"IF(EingabeAngabe!C23=\"\",\"\",EingabeAngabe!C23)","v":""},null,{"$f":"IF(EingabeAngabe!D23=\"\",\"\",EingabeAngabe!D23)","v":""},{"$f":"IF(EingabeAngabe!E23=\"\",\"\",EingabeAngabe!E23)","v":""},{"$f":"IF(OR(G18=\"\",G18>EingabeAngabe!F23),\"F\",EingabeAngabe!B23)","v":"F"}]
[{"$f":"EingabeAngabe!B24","v":"LE14"},{"$f":"IF(EingabeAngabe!C24=\"\",\"\",EingabeAngabe!C24)","v":""},null,{"$f":"IF(EingabeAngabe!D24=\"\",\"\",EingabeAngabe!D24)","v":""},{"$f":"IF(EingabeAngabe!E24=\"\",\"\",EingabeAngabe!E24)","v":""},{"$f":"IF(OR(G19=\"\",G19>EingabeAngabe!F24),\"F\",EingabeAngabe!B24)","v":"F"}]
[{"$f":"EingabeAngabe!B25","v":"LE15"},{"$f":"IF(EingabeAngabe!C25=\"\",\"\",EingabeAngabe!C25)","v":""},null,{"$f":"IF(EingabeAngabe!D25=\"\",\"\",EingabeAngabe!D25)","v":""},{"$f":"IF(EingabeAngabe!E25=\"\",\"\",EingabeAngabe!E25)","v":""},{"$f":"IF(OR(G20=\"\",G20>EingabeAngabe!F25),\"F\",EingabeAngabe!B25)","v":"F"}]
[{"$f":"EingabeAngabe!B26","v":"LE16"},{"$f":"IF(EingabeAngabe!C26=\"\",\"\",EingabeAngabe!C26)","v":""},null,{"$f":"IF(EingabeAngabe!D26=\"\",\"\",EingabeAngabe!D26)","v":""},{"$f":"IF(EingabeAngabe!E26=\"\",\"\",EingabeAngabe!E26)","v":""},{"$f":"IF(OR(G21=\"\",G21>EingabeAngabe!F26),\"F\",EingabeAngabe!B26)","v":"F"}]
[{"$f":"EingabeAngabe!B28","v":"MO19"},{"$f":"IF(EingabeAngabe!C28=\"\",\"\",EingabeAngabe!C28)","v":""},null,{"$f":"IF(EingabeAngabe!D28=\"\",\"\",EingabeAngabe!D28)","v":""},null,{"$f":"IF(OR(G22=\"\",G22>EingabeAngabe!F27),\"F\",EingabeAngabe!B28)","v":"F"}]
[{"$f":"EingabeAngabe!B29","v":"MO20"},{"$f":"IF(EingabeAngabe!C29=\"\",\"\",EingabeAngabe!C29)","v":""},null,{"$f":"IF(EingabeAngabe!D29=\"\",\"\",EingabeAngabe!D29)","v":""},null,{"$f":"IF(OR(G23=\"\",G23>EingabeAngabe!F28),\"F\",EingabeAngabe!B29)","v":"F"},null,{"$f":"IF(EingabeAngabe!F60>\"\",EingabeAngabe!E59,\"\")","v":"Eigener Notenkommentar:"}]
[{"$f":"EingabeAngabe!B30","v":"MO21"},{"$f":"IF(EingabeAngabe!C30=\"\",\"\",EingabeAngabe!C30)","v":""},null,{"$f":"IF(EingabeAngabe!D30=\"\",\"\",EingabeAngabe!D30)","v":""},null,{"$f":"IF(OR(G24=\"\",G24>EingabeAngabe!F29),\"F\",EingabeAngabe!B30)","v":"F"}]
[{"$f":"EingabeAngabe!B31","v":"MO22"},{"$f":"IF(EingabeAngabe!C31=\"\",\"\",EingabeAngabe!C31)","v":""},null,{"$f":"IF(EingabeAngabe!D31=\"\",\"\",EingabeAngabe!D31)","v":""},null,{"$f":"IF(OR(G25=\"\",G25>EingabeAngabe!F30),\"F\",EingabeAngabe!B31)","v":"F"}]
[{"$f":"EingabeAngabe!B33","v":"SY25"},{"$f":"IF(EingabeAngabe!C33=\"\",\"\",EingabeAngabe!C33)","v":""},null,{"$f":"IF(EingabeAngabe!D33=\"\",\"\",EingabeAngabe!D33)","v":""},null,{"$f":"IF(OR(G26=\"\",G26>EingabeAngabe!F31),\"F\",EingabeAngabe!B33)","v":"F"}]
[{"$f":"EingabeAngabe!B34","v":"SY26"},{"$f":"IF(EingabeAngabe!C34=\"\",\"\",EingabeAngabe!C34)","v":""},null,{"$f":"IF(EingabeAngabe!D34=\"\",\"\",EingabeAngabe!D34)","v":""},null,{"$f":"IF(OR(G27=\"\",G27>EingabeAngabe!F32),\"F\",EingabeAngabe!B34)","v":"F"}]
[{"$f":"EingabeAngabe!B35","v":"SY27"},{"$f":"IF(EingabeAngabe!C35=\"\",\"\",EingabeAngabe!C35)","v":""},null,{"$f":"IF(EingabeAngabe!D35=\"\",\"\",EingabeAngabe!D35)","v":""},null,{"$f":"IF(OR(G28=\"\",G28>EingabeAngabe!F33),\"F\",EingabeAngabe!B35)","v":"F"},null,"Summe Übersetzungstext",null,null,null,null,{"$f":"EingabeAngabe!AJ39","v":""}]
[{"$f":"EingabeAngabe!B36","v":"SY28"},{"$f":"IF(EingabeAngabe!C36=\"\",\"\",EingabeAngabe!C36)","v":""},null,{"$f":"IF(EingabeAngabe!D36=\"\",\"\",EingabeAngabe!D36)","v":""},null,{"$f":"IF(OR(G29=\"\",G29>EingabeAngabe!F34),\"F\",EingabeAngabe!B36)","v":"F"},null,"Summe Arbeitsaufgaben und Interpretation",null,null,null,null,{"$f":"EingabeAngabe!AJ40","v":""}]
[null,{"$f":"EingabeAngabe!C37","v":"SPRACHLICHE QUALITÄT IN DER ZIELSPRACHE"},null,null,null,{"$f":"IF(OR(G30=1,G30=3,G30=5,G30>5),\"F\",\"4/2/0\")","v":"4/2/0"},null,"Gesamtsumme",null,null,null,null,{"$f":"EingabeAngabe!AJ2","v":""}]
[null,null,null,null,null,null,null,"NOTE",null,null,{"$f":"IF(EingabeAngabe!AJ3=1,\"Sehr gut\",IF(EingabeAngabe!AJ3=2,\"Gut\",IF(EingabeAngabe!AJ3=3,\"Befriedigend\",IF(EingabeAngabe!AJ3=4,\"Genügend\",IF(EingabeAngabe!AJ3=5,\"Nicht genügend\",\"\")))))","v":""}]